{"text_format":"1","workbook":"xlsx","n_sheets":6,"sheets":["ReadMe","Data","Triangle Di Schnieper","Triangle incurred Chain Ladder","Triangle nb UWY Reporting dvlpt","Summary"],"not_rendered":{"charts":0,"images":0,"macros":1,"external_links":1,"defined_names":2,"comments":0,"pivot_tables":2},"unopened":[],"bounds":{"document_bytes":16777216,"sheet_cells":100000,"rows_first":2000,"rows_last":500,"rows_between":2000,"halvings":0,"cell_chars":16384,"cell_head_chars":4096},"cells_cut":0,"cells_raw":0,"read":"whole","date_system":"1900"}

{"sheet":"ReadMe","index":0,"n_rows":55,"n_cols":13,"rows_kept":55,"cut":false,"hidden":false,"merged":[[3,3,3,11],[30,3,30,11]]}
[]
[null,"How to run the macros ?"]
[]
[null,null,null,"Macro Mack1999"]
[]
[null,null,"Delete the sheet \"travail\""]
[]
[null,null,"Select the whole triangle with our mouse - See example below:"]
[]
[null,null,null,357848,1124788,1735330,2218270,2745596,3319994,3466336,3606286,3833515,3901463]
{"$rows_left_out":46}
{"sheet":"Data","index":1,"n_rows":329,"n_cols":35,"rows_kept":329,"cut":false,"hidden":false,"merged":[[1,2,1,5],[1,15,1,18],[1,26,1,29]]}
[]
[null,null,"Individual claims - Cumulative",null,null,null,null,null,null,null,null,null,null,null,null,"Individual claims - Incremental",null,null,null,null,null,null,null,null,null,null,"IBNER calculation - Article R. Schnieper"]
[]
["UWY","ClaimNb1","X1","X2","X3","X4","X5","X6","X7","X8","X9","X10","X11","X1","X2-X1",{"$f":"E4&\"-\"&D4","v":"X3-X2"},"X4-X3","X5-X4","X6-X5","X7-X6","X8-X7","X9-X8","X10-X9","X11-X10","X1",{"$f":"O4","v":"X2-X1"},{"$f":"P4","v":"X3-X2"},"X4-X3","X5-X4","X6-X5","X7-X6","X8-X7","X9-X8","X10-X9","X11-X10"]
[2006,145,"","",470.78032166582642,470.78032166582642,470.78032166582642,470.78032166582642,470.78032166582642,470.78032166582642,470.78032166582642,470.78032166582642,470.78032166582642,{"$f":"IF(C5<>\"\",C5,\"\")","v":""},{"$f":"IF(AND(C5<>\"\",D5<>\"\"),D5-C5,IF(AND(C5=\"\",D5<>\"\"),D5,\"\"))","v":""},{"$f":"IF(AND(D5<>\"\",E5<>\"\"),E5-D5,IF(AND(D5=\"\",E5<>\"\"),E5,\"\"))","v":470.78032166582642},{"$f":"IF(AND(E5<>\"\",F5<>\"\"),F5-E5,IF(AND(E5=\"\",F5<>\"\"),F5,\"\"))","v":0},{"$f":"IF(AND(F5<>\"\",G5<>\"\"),G5-F5,IF(AND(F5=\"\",G5<>\"\"),G5,\"\"))","v":0},{"$f":"IF(AND(G5<>\"\",H5<>\"\"),H5-G5,IF(AND(G5=\"\",H5<>\"\"),H5,\"\"))","v":0},{"$f":"IF(AND(H5<>\"\",I5<>\"\"),I5-H5,IF(AND(H5=\"\",I5<>\"\"),I5,\"\"))","v":0},{"$f":"IF(AND(I5<>\"\",J5<>\"\"),J5-I5,IF(AND(I5=\"\",J5<>\"\"),J5,\"\"))","v":0},{"$f":"IF(AND(J5<>\"\",K5<>\"\"),K5-J5,IF(AND(J5=\"\",K5<>\"\"),K5,\"\"))","v":0},{"$f":"IF(AND(K5<>\"\",L5<>\"\"),L5-K5,IF(AND(K5=\"\",L5<>\"\"),L5,\"\"))","v":0},{"$f":"IF(AND(L5<>\"\",M5<>\"\"),M5-L5,IF(AND(L5=\"\",M5<>\"\"),M5,\"\"))","v":0},null,{"$f":"IF(AND(C5<>\"\",D5<>\"\"),C5-D5,\"\")","v":""},{"$f":"IF(AND(D5<>\"\",E5<>\"\"),D5-E5,\"\")","v":""},0,0,0,0,0,0,0,0]
[2006,270,"",19962.804512016432,6591.8794329801212,6591.8794329801212,6591.8794329801212,6591.8794329801212,4373.8961460514674,4373.8961460514674,4373.8961460514674,4373.8961460514674,4373.8961460514674,"",19962.804512016432,-13370.925079036311,0,0,0,-2217.9832869286538,0,0,0,0,null,{"$f":"IF(AND(C6<>\"\",D6<>\"\"),C6-D6,\"\")","v":""},{"$f":"IF(AND(D6<>\"\",E6<>\"\"),D6-E6,\"\")","v":13370.925079036311},{"$f":"IF(AND(E6<>\"\",F6<>\"\"),E6-F6,\"\")","v":0},{"$f":"IF(AND(F6<>\"\",G6<>\"\"),F6-G6,\"\")","v":0},{"$f":"IF(AND(G6<>\"\",H6<>\"\"),G6-H6,\"\")","v":0},{"$f":"IF(AND(H6<>\"\",I6<>\"\"),H6-I6,\"\")","v":2217.9832869286538},{"$f":"IF(AND(I6<>\"\",J6<>\"\"),I6-J6,\"\")","v":0},{"$f":"IF(AND(J6<>\"\",K6<>\"\"),J6-K6,\"\")","v":0},{"$f":"IF(AND(K6<>\"\",L6<>\"\"),K6-L6,\"\")","v":0},{"$f":"IF(AND(L6<>\"\",M6<>\"\"),L6-M6,\"\")","v":0}]
[2006,342,"",3115.2988560807594,3115.2988560807594,3115.2988560807594,3115.2988560807594,3115.2988560807594,3115.2988560807594,3115.2988560807594,3115.2988560807594,3115.2988560807594,3115.2988560807594,"",3115.2988560807594,0,0,0,0,0,0,0,0,0,null,"",0,0,0,0,0,0,0,0,0]
[2006,447,"",4361.8003703764834,4361.8003703764834,4361.8003703764834,4361.8003703764834,4361.8003703764834,266.10706484964902,266.10706484964902,266.10706484964902,266.10706484964902,266.10706484964902,"",4361.8003703764834,0,0,0,0,-4095.6933055268346,0,0,0,0,null,"",0,0,0,0,4095.6933055268346,0,0,0,0]
[2006,467,"","",9764.7923784601462,9764.7923784601462,9764.7923784601462,9764.7923784601462,227.27325873522656,227.27325873522656,227.27325873522656,227.27325873522656,227.27325873522656,"","",9764.7923784601462,0,0,0,-9537.5191197249205,0,0,0,0,null,"","",0,0,0,9537.5191197249205,0,0,0,0]
[2006,493,"","",2090.3410225689536,2090.3410225689536,2090.3410225689536,1035.462059755871,1035.462059755871,1035.462059755871,1035.462059755871,1035.462059755871,1035.462059755871,"","",2090.3410225689536,0,0,-1054.8789628130826,0,0,0,0,0,null,"","",0,0,1054.8789628130826,0,0,0,0,0]
{"$rows_left_out":320}
{"sheet":"Triangle Di Schnieper","index":2,"n_rows":96,"n_cols":21,"rows_kept":96,"cut":false,"hidden":false,"merged":[[81,0,81,11],[0,2,0,4],[17,2,17,4],[32,0,32,9],[48,0,48,9],[48,11,48,20],[64,0,64,11]]}
[null,null,"Triangle Di - Article R. Schnieper"]
[]
[]
["Étiquettes de lignes","Somme de X13","Somme de X2-X12","Somme de X3-X22","Somme de X4-X32","Somme de X5-X42","Somme de X6-X52","Somme de X7-X62","Somme de X8-X72","Somme de X9-X82","Somme de X10-X92","Somme de X11-X102"]
[2006,null,79920.609603253804,12874.043346703413,-196394.33498642314,37363.214440253338,957.15782775449827,14654.66885001554,4336.0172695955962,-3787.5693357009254,-1673.9916914405549,1056.1522023578173]
[2007,null,-556246.52610617422,-7540494.1416994929,-59633.447317216487,1125810.8195403921,-3548.8369210631258,-401807.34397809173,-105973.63716762472,370704.33006941504,-12038.161585584749,0]
[2008,null,-1093819.9098224207,72297.087829151948,72633.223068962034,-65721.123890481147,-118782.42698766029,-172389.63153964514,1313796.3622634981,293667.92634487251,0,0]
[2009,null,-1165668.1217269464,-1580992.365233782,1208.6226378398405,-19675.370684792484,-12787.78136754761,470452.78079294314,-4413633.6339327665,0,0,0]
[2010,null,-351397.2439229372,-7246634.9111130247,-3744250.8616000596,-1385485.7965199256,484652.90312548942,791922.84752676706,0,0,0,0]
[2011,null,-50217.229346835637,-197062.78574740916,-125910.34026897402,-2082776.0698139097,14778.491395741097,0,0,0,0,0]
{"$rows_left_out":87}
{"sheet":"Triangle incurred Chain Ladder","index":3,"n_rows":20,"n_cols":16,"rows_kept":20,"cut":false,"hidden":false,"merged":[[0,2,0,4]]}
[null,null,"Incurred - Chain-ladder (Mack)"]
[]
["UWY","N","N+1","N+2","N+3","N+4","N+5","N+6","N+7","N+8","N+9","N+10","Reserves","CoV","Skewness","Kurtosis"]
[2006,161295.25876659516,541537.74457550736,1463061.0988817769,1659941.1747545165,1716881.4021247316,1709176.0747098804,1694521.405859865,1710571.8635607962,1715090.9090149475,1716764.9007063883,1723579.2787498108,0,0]
[2007,8189.4767517365672,844616.5027054036,8445206.2776768524,11710554.822555218,10948955.129715981,10945110.264600767,11696665.688981477,11809171.999943253,11826188.846458636,11855385.820768846,0,47057.742618169636,4.8210220102358099E-3,0,0]
[2008,100001,1520381.3882560951,2029839.225882228,1958706.1973068502,2029409.8258457663,2232183.4092611987,3207023.9878131398,1901909.5276953038,1608241.6013504313,0,0,10064.584726091474,0.24449514509266845,-0.53589951416021786,0.58191218983397341]
[2009,102001,1321073.5628814325,2917220.6617964231,2988581.6002503093,3107580.1596506881,4083554.2397073288,3611622.5911831758,8030480.9635877619,0,0,0,-92337.694617883302,-5.4249723291266374,-0.62181174584728405,2.4163383235925382]
[2010,202741.43411692797,888362.46698341449,16369437.311115783,20190576.562343311,21526660.982837398,28665051.115744878,27873128.268218111,0,0,0,0,4099822.8377718627,2.6619056011214042,0.42373019459952743,2.2275440685764134]
[2011,30001,423676.18808857672,1332416.2173657052,2076607.5425295543,4160813.4603522001,4186377.8822412798,0,0,0,0,0,660920.96459504031,4.7784071014842091,0.71417772768947041,2.872581042455606]
[2012,72056.763865083252,230748.56607258116,826076.54338462884,3955425.9161514272,4742006.8871682575,0,0,0,0,0,0,1800447.7722428367,2.2072554517489489,0.6924708059287551,3.0185873954915659]
{"$rows_left_out":11}
{"sheet":"Triangle nb UWY Reporting dvlpt","index":4,"n_rows":324,"n_cols":31,"rows_kept":324,"cut":false,"hidden":false,"merged":[[1,2,1,10],[17,17,17,19]]}
[]
[null,null,"Number of claims - Cumulative"]
[]
["UWY","ClaimNb","X1","X2","X3","X4","X5","X6","X7","X8","X9","X10","X11",null,null,"Étiquettes de lignes","Somme de X1","Somme de X2","Somme de X3","Somme de X4","Somme de X5","Somme de X6","Somme de X7","Somme de X8","Somme de X9","Somme de X10","Somme de X11"]
[2006,145,{"$f":"IF(Data!C5<>\"\",1,IF(Data!C5=\"\",\"\",0))","v":""},{"$f":"IF(Data!D5<>\"\",1,IF(Data!D5=\"\",\"\",0))","v":""},{"$f":"IF(Data!E5<>\"\",1,IF(Data!E5=\"\",\"\",0))","v":1},{"$f":"IF(Data!F5<>\"\",1,IF(Data!F5=\"\",\"\",0))","v":1},{"$f":"IF(Data!G5<>\"\",1,IF(Data!G5=\"\",\"\",0))","v":1},{"$f":"IF(Data!H5<>\"\",1,IF(Data!H5=\"\",\"\",0))","v":1},{"$f":"IF(Data!I5<>\"\",1,IF(Data!I5=\"\",\"\",0))","v":1},{"$f":"IF(Data!J5<>\"\",1,IF(Data!J5=\"\",\"\",0))","v":1},{"$f":"IF(Data!K5<>\"\",1,IF(Data!K5=\"\",\"\",0))","v":1},{"$f":"IF(Data!L5<>\"\",1,IF(Data!L5=\"\",\"\",0))","v":1},{"$f":"IF(Data!M5<>\"\",1,IF(Data!M5=\"\",\"\",0))","v":1},null,null,2006,3,13,21,22,24,23,23,24,24,24,25]
[2006,270,{"$f":"IF(Data!C6<>\"\",1,IF(Data!C6=\"\",\"\",0))","v":""},{"$f":"IF(Data!D6<>\"\",1,IF(Data!D6=\"\",\"\",0))","v":1},{"$f":"IF(Data!E6<>\"\",1,IF(Data!E6=\"\",\"\",0))","v":1},{"$f":"IF(Data!F6<>\"\",1,IF(Data!F6=\"\",\"\",0))","v":1},{"$f":"IF(Data!G6<>\"\",1,IF(Data!G6=\"\",\"\",0))","v":1},{"$f":"IF(Data!H6<>\"\",1,IF(Data!H6=\"\",\"\",0))","v":1},{"$f":"IF(Data!I6<>\"\",1,IF(Data!I6=\"\",\"\",0))","v":1},{"$f":"IF(Data!J6<>\"\",1,IF(Data!J6=\"\",\"\",0))","v":1},{"$f":"IF(Data!K6<>\"\",1,IF(Data!K6=\"\",\"\",0))","v":1},{"$f":"IF(Data!L6<>\"\",1,IF(Data!L6=\"\",\"\",0))","v":1},{"$f":"IF(Data!M6<>\"\",1,IF(Data!M6=\"\",\"\",0))","v":1},null,null,2007,2,20,35,41,43,42,46,47,48,49,0]
[2006,342,{"$f":"IF(Data!C7<>\"\",1,IF(Data!C7=\"\",\"\",0))","v":""},{"$f":"IF(Data!D7<>\"\",1,IF(Data!D7=\"\",\"\",0))","v":1},{"$f":"IF(Data!E7<>\"\",1,IF(Data!E7=\"\",\"\",0))","v":1},{"$f":"IF(Data!F7<>\"\",1,IF(Data!F7=\"\",\"\",0))","v":1},{"$f":"IF(Data!G7<>\"\",1,IF(Data!G7=\"\",\"\",0))","v":1},{"$f":"IF(Data!H7<>\"\",1,IF(Data!H7=\"\",\"\",0))","v":1},{"$f":"IF(Data!I7<>\"\",1,IF(Data!I7=\"\",\"\",0))","v":1},{"$f":"IF(Data!J7<>\"\",1,IF(Data!J7=\"\",\"\",0))","v":1},{"$f":"IF(Data!K7<>\"\",1,IF(Data!K7=\"\",\"\",0))","v":1},{"$f":"IF(Data!L7<>\"\",1,IF(Data!L7=\"\",\"\",0))","v":1},{"$f":"IF(Data!M7<>\"\",1,IF(Data!M7=\"\",\"\",0))","v":1},null,null,2008,1,11,15,16,18,21,26,28,28,0,0]
[2006,447,{"$f":"IF(Data!C8<>\"\",1,IF(Data!C8=\"\",\"\",0))","v":""},{"$f":"IF(Data!D8<>\"\",1,IF(Data!D8=\"\",\"\",0))","v":1},{"$f":"IF(Data!E8<>\"\",1,IF(Data!E8=\"\",\"\",0))","v":1},{"$f":"IF(Data!F8<>\"\",1,IF(Data!F8=\"\",\"\",0))","v":1},{"$f":"IF(Data!G8<>\"\",1,IF(Data!G8=\"\",\"\",0))","v":1},{"$f":"IF(Data!H8<>\"\",1,IF(Data!H8=\"\",\"\",0))","v":1},{"$f":"IF(Data!I8<>\"\",1,IF(Data!I8=\"\",\"\",0))","v":1},{"$f":"IF(Data!J8<>\"\",1,IF(Data!J8=\"\",\"\",0))","v":1},{"$f":"IF(Data!K8<>\"\",1,IF(Data!K8=\"\",\"\",0))","v":1},{"$f":"IF(Data!L8<>\"\",1,IF(Data!L8=\"\",\"\",0))","v":1},{"$f":"IF(Data!M8<>\"\",1,IF(Data!M8=\"\",\"\",0))","v":1},null,null,2009,1,13,16,22,29,31,30,31,0,0,0]
[2006,467,{"$f":"IF(Data!C9<>\"\",1,IF(Data!C9=\"\",\"\",0))","v":""},{"$f":"IF(Data!D9<>\"\",1,IF(Data!D9=\"\",\"\",0))","v":""},{"$f":"IF(Data!E9<>\"\",1,IF(Data!E9=\"\",\"\",0))","v":1},{"$f":"IF(Data!F9<>\"\",1,IF(Data!F9=\"\",\"\",0))","v":1},{"$f":"IF(Data!G9<>\"\",1,IF(Data!G9=\"\",\"\",0))","v":1},{"$f":"IF(Data!H9<>\"\",1,IF(Data!H9=\"\",\"\",0))","v":1},{"$f":"IF(Data!I9<>\"\",1,IF(Data!I9=\"\",\"\",0))","v":1},{"$f":"IF(Data!J9<>\"\",1,IF(Data!J9=\"\",\"\",0))","v":1},{"$f":"IF(Data!K9<>\"\",1,IF(Data!K9=\"\",\"\",0))","v":1},{"$f":"IF(Data!L9<>\"\",1,IF(Data!L9=\"\",\"\",0))","v":1},{"$f":"IF(Data!M9<>\"\",1,IF(Data!M9=\"\",\"\",0))","v":1},null,null,2010,4,19,25,29,38,40,40,0,0,0,0]
[2006,493,{"$f":"IF(Data!C10<>\"\",1,IF(Data!C10=\"\",\"\",0))","v":""},{"$f":"IF(Data!D10<>\"\",1,IF(Data!D10=\"\",\"\",0))","v":""},{"$f":"IF(Data!E10<>\"\",1,IF(Data!E10=\"\",\"\",0))","v":1},{"$f":"IF(Data!F10<>\"\",1,IF(Data!F10=\"\",\"\",0))","v":1},{"$f":"IF(Data!G10<>\"\",1,IF(Data!G10=\"\",\"\",0))","v":1},{"$f":"IF(Data!H10<>\"\",1,IF(Data!H10=\"\",\"\",0))","v":1},{"$f":"IF(Data!I10<>\"\",1,IF(Data!I10=\"\",\"\",0))","v":1},{"$f":"IF(Data!J10<>\"\",1,IF(Data!J10=\"\",\"\",0))","v":1},{"$f":"IF(Data!K10<>\"\",1,IF(Data!K10=\"\",\"\",0))","v":1},{"$f":"IF(Data!L10<>\"\",1,IF(Data!L10=\"\",\"\",0))","v":1},{"$f":"IF(Data!M10<>\"\",1,IF(Data!M10=\"\",\"\",0))","v":1},null,null,2011,1,9,16,38,39,41,0,0,0,0,0]
{"$rows_left_out":315}
{"sheet":"Summary","index":5,"n_rows":31,"n_cols":29,"rows_kept":31,"cut":false,"hidden":false,"merged":[[1,3,1,13],[19,1,19,10]]}
[]
[null,null,null,"Reserves, volatility and skewness based on individual claims analysis"]
[]
[null,null,"UWY","Known claims","Known claims incurred","IBNER","Future claims","CoV (N)","Stdev(N)","Var(N)","SK(N)","Stdev (SIC)","Var(SIC)","E(SIC)","Reserves (indiv based)","Reserves (chain-ladder)","Var (IBNER) factor","Standard deviation (indiv based)","Standard deviation chain-ladder","SK(SIC)","SK IBNER factor","Skewness (indiv based)","Skewness coef (indiv based)","Skewness coef chain ladder","Standard deviation per future claim","Standard deviation per future claim (CL)","Skewness^(1/3) per future claim","Skewness^(1/3) per future claim (CL)","E(X)xVar(X)"]
[null,0,2007,{"$f":"OFFSET('Triangle nb UWY Reporting dvlpt'!Z22,0,Summary!B5)","v":49},{"$f":"OFFSET('Triangle incurred Chain Ladder'!K5,0,Summary!B5)","v":11855385.820768846},{"$f":"E5*(OFFSET(Data!$AI$329,0,Summary!B5)-1)","v":-7293.4225526474565},{"$f":"'Triangle nb UWY Reporting dvlpt'!AB22","v":2.0416666666666714},{"$f":"'Triangle nb UWY Reporting dvlpt'!AC22","v":0.44698109862460894},{"$f":"H5*G5","v":0.91258640969191207},{"$f":"I5^2","v":0.8328139551543744},{"$f":"'Triangle nb UWY Reporting dvlpt'!AD22*Summary!I5^3","v":0},{"$f":"OFFSET(Data!$X$326,0,Summary!B5)","v":1596.9146541005027},{"$f":"L5^2","v":2550136.4124809285},{"$f":"MAX(0,OFFSET(Data!$X$329,0,Summary!B5))","v":272.57512173690361},{"$f":"G5*SUM(N$5:N5)+F5","v":-6736.9150124346106},{"$f":"'Triangle incurred Chain Ladder'!M5","v":47057.742618169636},{"$f":"'Triangle Di Schnieper'!M68","v":0},{"$f":"SQRT(SUM(M$5:M5)*(G5)+J5*SUM(N$5:N5)^2+E5^2*Q5)","v":2295.3004708092735},{"$f":"'Triangle incurred Chain Ladder'!N5*'Triangle incurred Chain Ladder'!M5","v":226.86641291420753},{"$f":"OFFSET(Data!$X$328,0,Summary!B5)","v":19737775517.217064},{"$f":"'Triangle Di Schnieper'!M85","v":0},{"$f":"SUM(T$5:T5)*(G5)+SUM(N$5:N5)^3*K5+3*J5*SUM(N$5:N5)*SUM(M$5:M5)-E5*U5","v":42034634640.197044},{"$f":"V5/R5^3","v":3.4760710092137939},{"$f":"'Triangle incurred Chain Ladder'!O5","v":0},{"$f":"R5/G5","v":1124.2288020290293},{"$f":"S5/G5","v":111.11824306001975},{"$f":"V5^(1/3)/G5","v":1703.0115261814369},{"$f":"X5^(1/3)*S5/G5","v":0},{"$f":"N5*M5","v":695103743.07769966}]
[null,-1,2008,{"$f":"OFFSET('Triangle nb UWY Reporting dvlpt'!Z23,0,Summary!B6)","v":28},{"$f":"OFFSET('Triangle incurred Chain Ladder'!K6,0,Summary!B6)","v":1608241.6013504313},{"$f":"E6*(OFFSET(Data!$AI$329,0,Summary!B6)-1)","v":638.14489931819799},{"$f":"'Triangle nb UWY Reporting dvlpt'!AB23","v":1.5717592592592595},{"$f":"'Triangle nb UWY Reporting dvlpt'!AC23","v":0.50870821391826382},0.7995668454872713,0.63930714040246595,{"$f":"'Triangle nb UWY Reporting dvlpt'!AD23*Summary!I6^3","v":-2.2868785060477553E-2},{"$f":"OFFSET(Data!$X$326,0,Summary!B6)","v":2441.2241224115878},5959575.215844227,{"$f":"MAX(0,OFFSET(Data!$X$329,0,Summary!B6))","v":422.88994522806473},{"$f":"G6*SUM(N$5:N6)+F6","v":1731.248557811748},{"$f":"'Triangle incurred Chain Ladder'!M6","v":10064.584726091474},{"$f":"'Triangle Di Schnieper'!M69","v":0},{"$f":"SQRT(SUM(M$5:M6)*(G6)+J6*SUM(N$5:N6)^2+E6^2*Q6)","v":3699.2475979435198},{"$f":"'Triangle incurred Chain Ladder'!N6*'Triangle incurred Chain Ladder'!M6","v":2460.7421029031898},{"$f":"OFFSET(Data!$X$328,0,Summary!B6)","v":89269582622.772202},{"$f":"'Triangle Di Schnieper'!M86","v":0},{"$f":"SUM(T$5:T6)*(G6)+SUM(N$5:N6)^3*K6+3*J6*SUM(N$5:N6)*SUM(M$5:M6)-E6*U6","v":182676288258.07129},3.6086268594642616,{"$f":"'Triangle incurred Chain Ladder'!O6","v":-0.53589951416021786},2353.5713730656853,1565.5973320385535,3610.0069009550989,-1271.6702958721999,2520244436.6108971]
[null,-2,2009,{"$f":"OFFSET('Triangle nb UWY Reporting dvlpt'!Z24,0,Summary!B7)","v":31},{"$f":"OFFSET('Triangle incurred Chain Ladder'!K7,0,Summary!B7)","v":8030480.9635877619},{"$f":"E7*(OFFSET(Data!$AI$329,0,Summary!B7)-1)","v":-340934.71999157232},{"$f":"'Triangle nb UWY Reporting dvlpt'!AB24","v":2.0708707444818586},{"$f":"'Triangle nb UWY Reporting dvlpt'!AC24","v":0.48393962012019059},1.0021764014025669,1.004357539528199,{"$f":"'Triangle nb UWY Reporting dvlpt'!AD24*Summary!I7^3","v":-3.6258196135616847E-3},{"$f":"OFFSET(Data!$X$326,0,Summary!B7)","v":59555.093942076084},3546809214.4495077,{"$f":"MAX(0,OFFSET(Data!$X$329,0,Summary!B7))","v":0},{"$f":"G7*SUM(N$5:N7)+F7","v":-339494.50173058547},{"$f":"'Triangle incurred Chain Ladder'!M7","v":-92337.694617883302},{"$f":"'Triangle Di Schnieper'!M70","v":1.9383970056262799E-10},{"$f":"SQRT(SUM(M$5:M7)*(G7)+J7*SUM(N$5:N7)^2+E7^2*Q7)","v":85808.5323907282},{"$f":"'Triangle incurred Chain Ladder'!N7*'Triangle incurred Chain Ladder'!M7","v":500929.43823736254},{"$f":"OFFSET(Data!$X$328,0,Summary!B7)","v":-40105697616027.484},{"$f":"'Triangle Di Schnieper'!M87","v":2.4162637515732897E-15},{"$f":"SUM(T$5:T7)*(G7)+SUM(N$5:N7)^3*K7+3*J7*SUM(N$5:N7)*SUM(M$5:M7)-E7*U7","v":-75377853247567.828},-0.11930326853469185,{"$f":"'Triangle incurred Chain Ladder'!O7","v":-0.62181174584728405},41435.967270954854,241893.14546654499,-20398.344809667044,-206463.46060040023,0]
[null,-3,2010,{"$f":"OFFSET('Triangle nb UWY Reporting dvlpt'!Z25,0,Summary!B8)","v":40},{"$f":"OFFSET('Triangle incurred Chain Ladder'!K8,0,Summary!B8)","v":27873128.268218111},{"$f":"E8*(OFFSET(Data!$AI$329,0,Summary!B8)-1)","v":3044617.3248440446},{"$f":"'Triangle nb UWY Reporting dvlpt'!AB25","v":4.378974934530504},{"$f":"'Triangle nb UWY Reporting dvlpt'!AC25","v":0.36679400403767809},1.6061817498170727,2.5798198134454338,{"$f":"'Triangle nb UWY Reporting dvlpt'!AD25*Summary!I8^3","v":0.47205536470256027},{"$f":"OFFSET(Data!$X$326,0,Summary!B8)","v":408681.66706722358},167020704996.84497,{"$f":"MAX(0,OFFSET(Data!$X$329,0,Summary!B8))","v":24940.774468841984},{"$f":"G8*SUM(N$5:N8)+F8","v":3156877.7751869634},{"$f":"'Triangle incurred Chain Ladder'!M8","v":4099822.8377718627},{"$f":"'Triangle Di Schnieper'!M71","v":9.3103872384651303E-4},{"$f":"SQRT(SUM(M$5:M8)*(G8)+J8*SUM(N$5:N8)^2+E8^2*Q8)","v":1213251.0540782367},{"$f":"'Triangle incurred Chain Ladder'!N8*'Triangle incurred Chain Ladder'!M8","v":10913341.375470372},{"$f":"OFFSET(Data!$X$328,0,Summary!B8)","v":6.6619907737517261E+17},{"$f":"'Triangle Di Schnieper'!M88","v":3.7208028860073897E-5},{"$f":"SUM(T$5:T8)*(G8)+SUM(N$5:N8)^3*K8+3*J8*SUM(N$5:N8)*SUM(M$5:M8)-E8*U8","v":2.9509459675937106E+18},1.6523773210724833,{"$f":"'Triangle incurred Chain Ladder'!O8","v":0.42373019459952743},277062.79944904882,2492213.7118011285,327552.78265655524,1871896.1538298093,4165625734953300]
[null,-4,2011,{"$f":"OFFSET('Triangle nb UWY Reporting dvlpt'!Z26,0,Summary!B9)","v":41},{"$f":"OFFSET('Triangle incurred Chain Ladder'!K9,0,Summary!B9)","v":4186377.8822412798},{"$f":"E9*(OFFSET(Data!$AI$329,0,Summary!B9)-1)","v":388768.33475946897},{"$f":"'Triangle nb UWY Reporting dvlpt'!AB26","v":6.8063320751749714},{"$f":"'Triangle nb UWY Reporting dvlpt'!AC26","v":0.68741957214825133},4.6788058830156984,21.89122449094231,{"$f":"'Triangle nb UWY Reporting dvlpt'!AD26*Summary!I9^3","v":42.875206406449713},{"$f":"OFFSET(Data!$X$326,0,Summary!B9)","v":103043.94862727032},10618055348.699526,{"$f":"MAX(0,OFFSET(Data!$X$329,0,Summary!B9))","v":2740.4050470384418},{"$f":"G9*SUM(N$5:N9)+F9","v":581909.20096952969},{"$f":"'Triangle incurred Chain Ladder'!M9","v":660920.96459504031},{"$f":"'Triangle Di Schnieper'!M72","v":8.2984348471970379E-2},{"$f":"SQRT(SUM(M$5:M9)*(G9)+J9*SUM(N$5:N9)^2+E9^2*Q9)","v":1644766.9704695875},{"$f":"'Triangle incurred Chain Ladder'!N9*'Triangle incurred Chain Ladder'!M9","v":3158149.4307407341},{"$f":"OFFSET(Data!$X$328,0,Summary!B9)","v":-1145912450844342},{"$f":"'Triangle Di Schnieper'!M89","v":-3.7677565203809542E-2},{"$f":"SUM(T$5:T9)*(G9)+SUM(N$5:N9)^3*K9+3*J9*SUM(N$5:N9)*SUM(M$5:M9)-E9*U9","v":4.8649531615127071E+18},1.0933659255814443,{"$f":"'Triangle incurred Chain Ladder'!O9","v":0.71417772768947041},241652.4718899063,464001.66725035186,248950.54821876541,414751.82764118939,29097772467309.703]
[null,-5,2012,{"$f":"OFFSET('Triangle nb UWY Reporting dvlpt'!Z27,0,Summary!B10)","v":45},{"$f":"OFFSET('Triangle incurred Chain Ladder'!K10,0,Summary!B10)","v":4742006.8871682575},{"$f":"E10*(OFFSET(Data!$AI$329,0,Summary!B10)-1)","v":396840.77098416764},{"$f":"'Triangle nb UWY Reporting dvlpt'!AB27","v":9.3933621235868969},{"$f":"'Triangle nb UWY Reporting dvlpt'!AC27","v":0.63511767481732873},5.9658903106496748,35.591847198703675,{"$f":"'Triangle nb UWY Reporting dvlpt'!AD27*Summary!I10^3","v":68.027351227863406},{"$f":"OFFSET(Data!$X$326,0,Summary!B10)","v":531209.61346423824},282183653436.82538,{"$f":"MAX(0,OFFSET(Data!$X$329,0,Summary!B10))","v":42248.77122158563},{"$f":"G10*SUM(N$5:N10)+F10","v":1060250.8767640854},{"$f":"'Triangle incurred Chain Ladder'!M10","v":1800447.7722428367},{"$f":"'Triangle Di Schnieper'!M73","v":8.3590682126873886E-2},{"$f":"SQRT(SUM(M$5:M10)*(G10)+J10*SUM(N$5:N10)^2+E10^2*Q10)","v":2531773.6585499807},{"$f":"'Triangle incurred Chain Ladder'!N10*'Triangle incurred Chain Ladder'!M10","v":3974048.1608722513},{"$f":"OFFSET(Data!$X$328,0,Summary!B10)","v":2.0403663335167749E+18},{"$f":"'Triangle Di Schnieper'!M90","v":-3.7675621010524317E-2},{"$f":"SUM(T$5:T10)*(G10)+SUM(N$5:N10)^3*K10+3*J10*SUM(N$5:N10)*SUM(M$5:M10)-E10*U10","v":2.8930936283984105E+19},1.7827393793467332,{"$f":"'Triangle incurred Chain Ladder'!O10","v":0.6924708059287551},269527.95231780247,423069.83469671063,326813.33174394752,374293.72850036615,1.192191261652364E+16]
{"$rows_left_out":21}