{"text_format":"1","workbook":"xlsx","n_sheets":11,"sheets":["Basic Setup","Run Control","ClaimData","LoB","LoBValidate","FreqCopula","Function","FactorTable","Index","Empirical","List"],"not_rendered":{"charts":0,"images":2,"macros":1,"external_links":0,"defined_names":48,"comments":3,"pivot_tables":0},"unopened":[],"bounds":{"document_bytes":16777216,"sheet_cells":100000,"rows_first":2000,"rows_last":500,"rows_between":2000,"halvings":0,"cell_chars":16384,"cell_head_chars":4096},"cells_cut":0,"cells_raw":0,"read":"whole","date_system":"1900"}

{"sheet":"Basic Setup","index":0,"n_rows":6,"n_cols":9,"rows_kept":6,"cut":false,"hidden":false,"merged":[]}
[null,"Simulator 2.0 - R Setup (System recommends R >= 4.0.4)"]
[]
[null,"This version is built for the new R4.0. For older R version, please use cascsim.xlsm instead."]
[null,"R Installation Folder","C:\\LSM\\R\\R-4.1.2\\bin\\x64",null,null,null,null,null,"R Location in C4 Verified."]
[]
[null,null,null,null,null,null,null,null,"Required R Libraries are installed. You still can click button to check updates."]

{"sheet":"Run Control","index":1,"n_rows":36,"n_cols":7,"rows_kept":36,"cut":false,"hidden":false,"merged":[[8,3,8,5]]}
[null,"Individual Claim Simulator API - Run Control"]
[]
[null,"1. Parallel Computing",null,null,null,null,"Available Cores"]
[null,"# of CPU Cores",1,null,null,null,32767]
[null,"2. Simulation"]
[null,"# of Simulations (Portfolio)",2]
[null,"Monitoring Frequency",1]
[null,"3. Output"]
[null,"Working Folder","C:\\lsm\\wd","Mid-process files (don't change)"]
[null,"4. Valuation Period"]
[null,"Claim Data Start Date","2008-01-01"]
[null,"Claim Data Ending Date (Future Claim Start Date)","2017-12-31"]
[null,"Future Claim Ending Date","2018-12-31"]
[null,"5. Simulation Claim Class"]
[null,"IBNER (Open Claim)","Yes"]
[null,"REOPEN (Claim Reopen)","No"]
[null,"IBNR","Yes"]
[null,"UPR (Future Claim)","No"]
[null,"Simulation Result File Name","sim",{"$f":"wf&IF(RIGHT(wf,1)=\"\\\",\"\",\"\\\")&C19&\".csv\"","v":"C:\\lsm\\wd\\sim.csv"}]
[null,"Result Summary File Name","summary","C:\\lsm\\wd\\summary.csv"]
[null,"Result Triangle File",{"$f":"\"tri\"&simsumFile","v":"trisummary"},{"$f":"wf&IF(RIGHT(wf,1)=\"\\\",\"\",\"\\\")&\"tri\"&C20&\".csv\"","v":"C:\\lsm\\wd\\trisummary.csv"}]
[null,"HTML Report File Name","simReport",{"$f":"wf&IF(RIGHT(wf,1)=\"\\\",\"\",\"\\\")&\"report\\\"&C22&\".html\"","v":"C:\\lsm\\wd\\report\\simReport.html"}]
[null,"Simulation Run Log File","mylog",{"$f":"wf&IF(RIGHT(wf,1)=\"\\\",\"\",\"\\\")&C23&\".txt\"","v":"C:\\lsm\\wd\\mylog.txt"}]
[null,"Distribution Fitting File Name","fitsummary",{"$f":"wf&IF(RIGHT(wf,1)=\"\\\",\"\",\"\\\")&C24&\".csv\"","v":"C:\\lsm\\wd\\fitsummary.csv"}]
[null,"Copula Fitting File Name","fitsumcop",{"$f":"wf&IF(RIGHT(wf,1)=\"\\\",\"\",\"\\\")&C25&\".csv\"","v":"C:\\lsm\\wd\\fitsumcop.csv"}]
[null,"Claim Data Fitting Report","fitreport",{"$f":"wf&IF(RIGHT(wf,1)=\"\\\",\"\",\"\\\")&\"fit\\\"&C26&\".html\"","v":"C:\\lsm\\wd\\fit\\fitreport.html"}]
[null,"Fitting Run Log File","myfitlog",{"$f":"wf&IF(RIGHT(wf,1)=\"\\\",\"\",\"\\\")&C27&\".txt\"","v":"C:\\lsm\\wd\\myfitlog.txt"}]
[null,"6. Fitting Target"]
[null,"Frequency","Yes"]
[null,"Severity","Yes"]
[null,"Report Lag","Yes"]
[null,"Settlement Lag","Yes"]
[null,"Lags and Severity Correlation","Yes"]
[null,"Frequency Copula","Yes"]
[null,"Deductible","Yes"]
[null,"Limit","Yes"]

{"sheet":"ClaimData","index":2,"n_rows":105,"n_cols":21,"rows_kept":105,"cut":false,"hidden":false,"merged":[[2,3,2,5]]}
[null,null,"Individual Claim Simulator API - Claim Data Setup"]
[]
[null,null,"Claim File","C:\\lsm\\test2_claim.csv"]
[]
[null,null,"Data Field","Use","Match Field","Required Format",null,null,null,null,null,null,null,null,null,null,null,null,null,"Yes","ClaimID"]
[null,null,"ClaimNo","Yes","ClaimID",{"$f":"IF(RIGHT(E6,4)=\"Date\",\"yyyy-mm-dd\",IF(E6=\"claimLiability\",\"TRUE/FALSE\",IF(E6=\"status\",\"OPEN/CLOSED\",IF(OR(E6=\"ClaimID\",E6=\"LoB\",E6=\"Type\"),\"numchar\",IF(E6=\"\",\"\",\"num\")))))","v":"numchar"},null,null,null,null,null,null,null,null,null,null,null,null,null,"Yes","occurrenceDate"]
[null,null,"AccidentDate","Yes","occurrenceDate","yyyy-mm-dd",null,null,null,null,null,null,null,null,null,null,null,null,null,"Yes","reportDate"]
[null,null,"ReportDate","Yes","reportDate","yyyy-mm-dd",null,null,null,null,null,null,null,null,null,null,null,null,null,"Yes","LoB"]
[null,null,"Line","Yes","LoB","numchar",null,null,null,null,null,null,null,null,null,null,null,null,null,"Yes","Type"]
[null,null,"Type","Yes","Type","numchar",null,null,null,null,null,null,null,null,null,null,null,null,null,"Yes","claimLiability"]
[null,null,"ClaimLiability","Yes","claimLiability","TRUE/FALSE",null,null,null,null,null,null,null,null,null,null,null,null,null,"Yes","Limit"]
[null,null,"Limit","Yes","Limit","num",null,null,null,null,null,null,null,null,null,null,null,null,null,"Yes","Deductible"]
[null,null,"Deductible","Yes","Deductible","num",null,null,null,null,null,null,null,null,null,null,null,null,null,"Yes","Paid"]
[null,null,"TotalPayment","Yes","Paid","num",null,null,null,null,null,null,null,null,null,null,null,null,null,"Yes","settlementDate"]
[null,null,"PaymentDate","Yes","settlementDate","yyyy-mm-dd",null,null,null,null,null,null,null,null,null,null,null,null,null,"Yes"]
[null,null,"CloseDate","No",null,"",null,null,null,null,null,null,null,null,null,null,null,null,null,"Yes","status"]
[null,null,"Status","Yes","status","OPEN/CLOSED",null,null,null,null,null,null,null,null,null,null,null,null,null,"Yes"]
[null,null,"reportedCount","No",null,"",null,null,null,null,null,null,null,null,null,null,null,null,null,"Yes"]
[null,null,"closedPaidCount","No",null,"",null,null,null,null,null,null,null,null,null,null,null,null,null,"Yes"]
[null,null,"closedUnPaidCount","No",null,"",null,null,{"$f":"getDates()","v":0},null,null,null,null,null,null,null,null,null,null,"Yes"]
[null,null,"openCount","No",null,"",null,null,null,null,null,null,null,null,null,null,null,null,null,"Yes"]
[null,null,"Paid","No",null,"",null,null,null,null,null,null,null,null,null,null,null,null,null,"Yes"]
[null,null,"Outstanding","No",null,"",null,null,null,null,null,null,null,null,null,null,null,null,null,"Yes","incurredLoss"]
[null,null,"Incurred","Yes","incurredLoss","num"]
[null,null,null,"No",null,{"$f":"IF(RIGHT(E25,4)=\"Date\",\"yyyy-mm-dd\",IF(E25=\"claimLiability\",\"TRUE/FALSE\",IF(E25=\"status\",\"OPEN/CLOSED\",IF(OR(E25=\"ClaimID\",E25=\"LoB\",E25=\"Type\"),\"numchar\",IF(E25=\"\",\"\",\"num\")))))","v":""}]
[null,null,null,"No",null,""]
[null,null,null,"No",null,""]
[null,null,null,null,null,""]
[null,null,null,null,null,""]
[null,null,null,null,null,""]
[null,null,null,null,null,""]
[null,null,null,null,null,""]
[null,null,null,null,null,""]
[null,null,null,null,null,""]
[null,null,null,null,null,""]
[null,null,null,null,null,""]
[null,null,null,null,null,""]
[null,null,null,null,null,""]
[null,null,null,null,null,""]
[null,null,null,null,null,""]
[null,null,null,null,null,""]
[null,null,null,null,null,""]
[null,null,null,null,null,""]
[null,null,null,null,null,""]
[null,null,null,null,null,""]
[null,null,null,null,null,""]
[null,null,null,null,null,""]
[null,null,null,null,null,""]
[null,null,null,null,null,""]
[null,null,null,null,null,""]
[null,null,null,null,null,""]
[null,null,null,null,null,""]
[null,null,null,null,null,""]
[null,null,null,null,null,""]
[null,null,null,null,null,""]
[null,null,null,null,null,""]
[null,null,null,null,null,""]
[null,null,null,null,null,""]
[null,null,null,null,null,""]
[null,null,null,null,null,""]
[null,null,null,null,null,""]
[null,null,null,null,null,""]
[null,null,null,null,null,""]
[null,null,null,null,null,""]
[null,null,null,null,null,""]
[null,null,null,null,null,""]
[null,null,null,null,null,""]
[null,null,null,null,null,""]
[null,null,null,null,null,""]
[null,null,null,null,null,""]
[null,null,null,null,null,{"$f":"IF(RIGHT(E71,4)=\"Date\",\"yyyy-mm-dd\",IF(E71=\"claimLiability\",\"TRUE/FALSE\",IF(E71=\"status\",\"OPEN/CLOSED\",IF(OR(E71=\"ClaimID\",E71=\"LoB\",E71=\"Type\"),\"numchar\",IF(E71=\"\",\"\",\"num\")))))","v":""}]
[null,null,null,null,null,""]
[null,null,null,null,null,""]
[null,null,null,null,null,""]
[null,null,null,null,null,""]
[null,null,null,null,null,""]
[null,null,null,null,null,""]
[null,null,null,null,null,""]
[null,null,null,null,null,""]
[null,null,null,null,null,""]
[null,null,null,null,null,""]
[null,null,null,null,null,""]
[null,null,null,null,null,""]
[null,null,null,null,null,""]
[null,null,null,null,null,""]
[null,null,null,null,null,""]
[null,null,null,null,null,""]
[null,null,null,null,null,""]
[null,null,null,null,null,""]
[null,null,null,null,null,""]
[null,null,null,null,null,""]
[null,null,null,null,null,""]
[null,null,null,null,null,""]
[null,null,null,null,null,""]
[null,null,null,null,null,""]
[null,null,null,null,null,""]
[null,null,null,null,null,""]
[null,null,null,null,null,""]
[null,null,null,null,null,""]
[null,null,null,null,null,""]
[null,null,null,null,null,""]
[null,null,null,null,null,""]
[null,null,null,null,null,""]
[null,null,null,null,null,""]
[null,null,null,null,null,""]

{"sheet":"LoB","index":3,"n_rows":7,"n_cols":58,"rows_kept":7,"cut":false,"hidden":false,"merged":[[2,57,2,58],[3,53,3,54],[3,55,3,56],[2,6,2,19],[3,14,3,19],[3,8,3,13],[3,6,3,7],[3,47,3,51],[3,41,3,46],[3,35,3,40],[3,20,3,26],[3,27,3,34],[2,20,2,52],[2,55,2,56],[2,53,2,54]]}
[null,null,"Individual Claim Simulator API - LoB Assumptions"]
[null,null,"Intrim Step DO NOT CHANGE",null,null,3,4,{"$f":"MAX(IF(List!J2:J28<>\"\",ROW(List!J2:J28)))-1","v":13},6,7,8,9,10,11,12,13,14,15,16,17,{"$f":"AB2","v":3},19,20,21,22,23,24,{"$f":"MAX(IF(List!L2:L28<>\"\",ROW(List!L2:L28)))-1","v":3},26,27,28,29,30,31,32,33,34,35,36,37,38,39,40,41,42,43,44,45,46,47,48,49,{"$f":"MAX(IF(List!K2:K28<>\"\",ROW(List!K2:K28)))-1","v":4},51,52,53,54,{"$f":"MAX(IF(List!M2:M28<>\"\",ROW(List!M2:M28)))-1","v":7}]
[null,null,null,null,null,"IBNER","ROPEN",null,null,null,null,null,null,null,null,null,null,null,null,null,"IBNR/UPR",null,null,null,null,null,null,null,null,null,null,null,null,null,null,null,null,null,null,null,null,null,null,null,null,null,null,null,null,null,null,null,null,"Deductible",null,"Limit",null,"P0"]
[null,null,null,null,null,"Open Claim"," Claim Reopenness",null,"Reopen Lag",null,null,null,null,null,"Resettlement Lag",null,null,null,null,null,"Frequency",null,null,null,null,null,null,"Severity",null,null,null,null,null,null,null,"Report Lag",null,null,null,null,null,"Settlement Lag",null,null,null,null,null,"Copula (Severity, Settlement Lag, and Report Lag)",null,null,null,null,"LAE","Deductible",null,"Limit",null,"P0"]
[null,null,"Business Line","Claim Type","Included","IBNER Factor","Reopen Probability","Reopen IBNER Factor","Distribution","para1","para2","Truncated","Min","Max","Distribution","para1","para2","Truncated","Min","Max","Exopusure Index","Distribution","para1","para2","Truncated","Min","Max","Severity index","Fitting Data","Distribution","para1","para2","Truncated","Min","Max","Distribution","para1","para2","Truncated","Min","Max","Distribution","para1","para2","Truncated","Min","Max","Type","Para1","Para2","Para3","df","Func/Table","Distribution","Para1","Distribution","Para1","Prob."]
[null,null,"Home","Dwelling","Yes","CondPaid","ZeroTable","Level","Exponential",5.0000000000000001E-3,null,"No",null,null,"Exponential",5.0000000000000001E-3,null,"No",null,null,"Flat","Poisson",99.049000000000007,null,null,null,null,"Flat","CLOSED","Normal",183286.6317,70239.919800000003,null,null,null,"Weibull",9.2530000000000001,798.529,null,null,null,"Weibull",6.484,179.047,null,null,null,"Independent",null,null,null,null,"ZeroFunc","Empirical","HomeDwellingDeductibleemp","Empirical","HomeDwellingLimitemp","HomeDwellingp0"]
[null,null,"Auto","PD","Yes","CondPaid","ZeroTable","Level","Exponential",5.0000000000000001E-3,null,"No",null,null,"Exponential",5.0000000000000001E-3,null,"No",null,null,"Flat","NegativeBinomial",22.172000000000001,8.1000000000000003E-2,null,null,null,"Flat","CLOSED","Lognormal",8.9276700000000009,0.52415,null,null,null,"Exponential",1.0999999999999999E-2,null,null,null,null,"Exponential",3.0000000000000001E-3,null,null,null,null,"Independent",null,null,null,null,"ZeroFunc","Empirical","AutoPDDeductibleemp","Empirical","AutoPDLimitemp","AutoPDp0"]

{"sheet":"LoBValidate","index":4,"n_rows":25,"n_cols":58,"rows_kept":25,"cut":false,"hidden":true,"merged":[[3,53,3,54],[3,55,3,56],[2,6,2,19],[2,20,2,56],[3,6,3,7],[3,8,3,13],[3,14,3,19],[3,20,3,26],[3,27,3,34],[3,35,3,40],[3,41,3,46],[3,47,3,51]]}
[null,null,"Individual Claim Simulator API - LoB Assumption Validation"]
[]
[null,null,{"$f":"IF(COUNTIFS(F6:BF25,\"<>OK\",F6:BF25,\">\"\"\")=0,\"Correct\",\"Wrong\")","v":"Correct"},null,null,"RBNER","ROPEN",null,null,null,null,null,null,null,null,null,null,null,null,null,"IBNR/UPR"]
[null,null,null,null,null,"Open Claim"," Claim Reopenness",null,"Reopen Lag",null,null,null,null,null,"Resettlement Lag",null,null,null,null,null,"Frequency",null,null,null,null,null,null,"Severity",null,null,null,null,null,null,null,"Report Lag",null,null,null,null,null,"Settlement Lag",null,null,null,null,null,"Copula",null,null,null,null,"LAE","Deductible",null,"Limit",null,"P0"]
[null,null,"Business Line","Claim Type","Included","Loss Development Factor","Reopen Probability","Reopen Loss Development Factor","Distribution","para1","para2","Truncated","Min","Max","Distribution","para1","para2","Truncated","Min","Max","Exopusure Index","Distribution","para1","para2","Truncated","Min","Max","Severity index","Fitting Data","Distribution","para1","para2","Truncated","Min","Max","Distribution","para1","para2","Truncated","Min","Max","Distribution","para1","para2","Truncated","Min","Max","Type","Para1","Para2","Para3","df","Function","Distribution","Para1","Distribution","Para1","Prob."]
[null,{"$f":"IF(COUNTIFS(F6:BF6,\"<>OK\",F6:BF6,\">\"\"\")=0,\"Correct\",\"Wrong\")","v":"Correct"},{"$f":"IF(LoB!C6=\"\",\"\",LoB!C6)","v":"Home"},{"$f":"IF(LoB!D6=\"\",\"\",LoB!D6)","v":"Dwelling"},{"$f":"IF(LoB!E6=\"\",\"\",LoB!E6)","v":"Yes"},{"$f":"IF($E6<>\"Yes\",\"\",IF(OR(LoB!F6=\"CondPaid\",LoB!F6=\"CondIncurLoss\"),\"OK\",IF(OR(AND(ISERROR(MATCH(LoB!F6,FactorTable!$B$1:$GS$1,0)),ISERROR(MATCH(LoB!F6,Function!$C$1:$CX$1,0)))),\"Not Available\",\"OK\")))","v":"OK"},{"$f":"IF($E6<>\"Yes\",\"\",IF(OR(LoB!G6=\"\",AND(ISERROR(MATCH(LoB!G6,FactorTable!$B$1:$GS$1,0)),ISERROR(MATCH(LoB!G6,Function!$C$1:$CX$1,0)))),\"Not Available\",\"OK\"))","v":"OK"},{"$f":"IF($E6<>\"Yes\",\"\",IF(OR(LoB!H6=\"CondPaid\",LoB!H6=\"CondIncurLoss\"),\"OK\",IF(OR(AND(ISERROR(MATCH(LoB!H6,FactorTable!$B$1:$GS$1,0)),ISERROR(MATCH(LoB!H6,Function!$C$1:$CX$1,0)))),\"Not Available\",\"OK\")))","v":"OK"},{"$f":"IF($E6<>\"Yes\",\"\",IF(ISERROR(MATCH(LoB!I6,List!$A$2:$A$101,0)),\"Not Available\",\"OK\"))","v":"OK"},{"$f":"IF(I6<>\"OK\",\"\",IF(LoB!I6=\"Empirical\",IF(OR(LoB!J6=\"\",ISERROR(MATCH(LoB!J6,Empirical!$B$1:$CW$1,0))),\"Not Available\",\"OK\"),IF(AND(VLOOKUP(LoB!I6,List!$A$2:$E$101,2,FALSE)<>\"\",LoB!J6<=VLOOKUP(LoB!I6,List!$A$2:$E$101,2,FALSE)),\"Too Small\",IF(AND(VLOOKUP(LoB!I6,List!$A$2:$E$101,3,FALSE)<>\"\",LoB!J6>=VLOOKUP(LoB!I6,List!$A$2:$E$101,3,FALSE)),\"Too Large\",\"OK\"))))","v":"OK"},{"$f":"IF(I6<>\"OK\",\"\",IF(AND(VLOOKUP(LoB!I6,List!$A$2:$E$101,4,FALSE)<>\"\",LoB!K6<=VLOOKUP(LoB!I6,List!$A$2:$E$101,4,FALSE)),\"Too Small\",IF(AND(VLOOKUP(LoB!I6,List!$A$2:$E$101,5,FALSE)<>\"\",LoB!K6>=VLOOKUP(LoB!I6,List!$A$2:$E$101,5,FALSE)),\"Too Large\",\"OK\")))","v":"OK"},null,{"$f":"IF(I6<>\"OK\",\"\",IF(AND(LoB!L6=\"Yes\",LoB!M6>LoB!N6),\"Min > Max\",IF(AND(LoB!L6=\"Yes\",NOT(ISNUMBER(LoB!M6))),\"Not Number\",\"OK\")))","v":"OK"},{"$f":"IF(I6<>\"OK\",\"\",IF(AND(LoB!L6=\"Yes\",LoB!M6>LoB!N6),\"Min > Max\",IF(AND(LoB!L6=\"Yes\",NOT(ISNUMBER(LoB!N6))),\"Not Number\",\"OK\")))","v":"OK"},{"$f":"IF($E6<>\"Yes\",\"\",IF(ISERROR(MATCH(LoB!O6,List!$A$2:$A$101,0)),\"Not Available\",\"OK\"))","v":"OK"},{"$f":"IF(O6<>\"OK\",\"\",IF(LoB!O6=\"Empirical\",IF(OR(LoB!P6=\"\",ISERROR(MATCH(LoB!P6,Empirical!$B$1:$CW$1,0))),\"Not Available\",\"OK\"),IF(AND(VLOOKUP(LoB!O6,List!$A$2:$E$101,2,FALSE)<>\"\",LoB!P6<=VLOOKUP(LoB!O6,List!$A$2:$E$101,2,FALSE)),\"Too Small\",IF(AND(VLOOKUP(LoB!O6,List!$A$2:$E$101,3,FALSE)<>\"\",LoB!P6>=VLOOKUP(LoB!O6,List!$A$2:$E$101,3,FALSE)),\"Too Large\",\"OK\"))))","v":"OK"},{"$f":"IF(O6<>\"OK\",\"\",IF(AND(VLOOKUP(LoB!O6,List!$A$2:$E$101,4,FALSE)<>\"\",LoB!Q6<=VLOOKUP(LoB!O6,List!$A$2:$E$101,4,FALSE)),\"Too Small\",IF(AND(VLOOKUP(LoB!O6,List!$A$2:$E$101,5,FALSE)<>\"\",LoB!Q6>=VLOOKUP(LoB!O6,List!$A$2:$E$101,5,FALSE)),\"Too Large\",\"OK\")))","v":"OK"},null,{"$f":"IF(O6<>\"OK\",\"\",IF(AND(LoB!R6=\"Yes\",LoB!S6>LoB!T6),\"Min > Max\",IF(AND(LoB!R6=\"Yes\",NOT(ISNUMBER(LoB!S6))),\"Not Number\",\"OK\")))","v":"OK"},{"$f":"IF(O6<>\"OK\",\"\",IF(AND(LoB!R6=\"Yes\",LoB!S6>LoB!T6),\"Min > Max\",IF(AND(LoB!R6=\"Yes\",NOT(ISNUMBER(LoB!T6))),\"Not Number\",\"OK\")))","v":"OK"},{"$f":"IF($E6<>\"Yes\",\"\",IF(OR(LoB!U6=\"\",ISERROR(MATCH(LoB!U6,Index!$B$1:$CW$1,0))),\"Not Available\",\"OK\"))","v":"OK"},{"$f":"IF($E6<>\"Yes\",\"\",IF(ISERROR(MATCH(LoB!V6,List!$A$2:$A$101,0)),\"Not Available\",\"OK\"))","v":"OK"},{"$f":"IF(V6<>\"OK\",\"\",IF(LoB!V6=\"Empirical\",IF(OR(LoB!W6=\"\",ISERROR(MATCH(LoB!W6,Empirical!$B$1:$CW$1,0))),\"Not Available\",\"OK\"),IF(AND(VLOOKUP(LoB!V6,List!$A$2:$E$101,2,FALSE)<>\"\",LoB!W6<=VLOOKUP(LoB!V6,List!$A$2:$E$101,2,FALSE)),\"Too Small\",IF(AND(VLOOKUP(LoB!V6,List!$A$2:$E$101,3,FALSE)<>\"\",LoB!W6>=VLOOKUP(LoB!V6,List!$A$2:$E$101,3,FALSE)),\"Too Large\",\"OK\"))))","v":"OK"},{"$f":"IF(V6<>\"OK\",\"\",IF(AND(VLOOKUP(LoB!V6,List!$A$2:$E$101,4,FALSE)<>\"\",LoB!X6<=VLOOKUP(LoB!V6,List!$A$2:$E$101,4,FALSE)),\"Too Small\",IF(AND(VLOOKUP(LoB!V6,List!$A$2:$E$101,5,FALSE)<>\"\",LoB!X6>=VLOOKUP(LoB!V6,List!$A$2:$E$101,5,FALSE)),\"Too Large\",\"OK\")))","v":"OK"},null,{"$f":"IF(V6<>\"OK\",\"\",IF(AND(LoB!Y6=\"Yes\",LoB!Z6>LoB!AA6),\"Min > Max\",IF(AND(LoB!Y6=\"Yes\",NOT(ISNUMBER(LoB!Z6))),\"Not Number\",\"OK\")))","v":"OK"},{"$f":"IF(V6<>\"OK\",\"\",IF(AND(LoB!Y6=\"Yes\",LoB!Z6>LoB!AA6),\"Min > Max\",IF(AND(LoB!Y6=\"Yes\",NOT(ISNUMBER(LoB!AA6))),\"Not Number\",\"OK\")))","v":"OK"},{"$f":"IF($E6<>\"Yes\",\"\",IF(OR(LoB!AB6=\"\",ISERROR(MATCH(LoB!AB6,Index!$B$1:$CW$1,0))),\"Not Available\",\"OK\"))","v":"OK"},{"$f":"IF($E6<>\"Yes\",\"\",IF(OR(LoB!AC6=\"CLOSED\",LoB!AC6=\"ALL\"),\"OK\",\"Not Available\"))","v":"OK"},{"$f":"IF($E6<>\"Yes\",\"\",IF(ISERROR(MATCH(LoB!AD6,List!$A$2:$A$101,0)),\"Not Available\",\"OK\"))","v":"OK"},{"$f":"IF(AD6<>\"OK\",\"\",IF(LoB!AD6=\"Empirical\",IF(OR(LoB!AE6=\"\",ISERROR(MATCH(LoB!AE6,Empirical!$B$1:$CW$1,0))),\"Not Available\",\"OK\"),IF(AND(VLOOKUP(LoB!AD6,List!$A$2:$E$101,2,FALSE)<>\"\",LoB!AE6<=VLOOKUP(LoB!AD6,List!$A$2:$E$101,2,FALSE)),\"Too Small\",IF(AND(VLOOKUP(LoB!AD6,List!$A$2:$E$101,3,FALSE)<>\"\",LoB!AE6>=VLOOKUP(LoB!AD6,List!$A$2:$E$101,3,FALSE)),\"Too Large\",\"OK\"))))","v":"OK"},{"$f":"IF(AD6<>\"OK\",\"\",IF(AND(VLOOKUP(LoB!AD6,List!$A$2:$E$101,4,FALSE)<>\"\",LoB!AF6<=VLOOKUP(LoB!AD6,List!$A$2:$E$101,4,FALSE)),\"Too Small\",IF(AND(VLOOKUP(LoB!AD6,List!$A$2:$E$101,5,FALSE)<>\"\",LoB!AF6>=VLOOKUP(LoB!AD6,List!$A$2:$E$101,5,FALSE)),\"Too Large\",\"OK\")))","v":"OK"},null,{"$f":"IF(AD6<>\"OK\",\"\",IF(AND(LoB!AG6=\"Yes\",LoB!AH6>LoB!AI6),\"Min > Max\",IF(AND(LoB!AG6=\"Yes\",NOT(ISNUMBER(LoB!AH6))),\"Not Number\",\"OK\")))","v":"OK"},{"$f":"IF(AD6<>\"OK\",\"\",IF(AND(LoB!AG6=\"Yes\",LoB!AH6>LoB!AI6),\"Min > Max\",IF(AND(LoB!AG6=\"Yes\",NOT(ISNUMBER(LoB!AI6))),\"Not Number\",\"OK\")))","v":"OK"},{"$f":"IF($E6<>\"Yes\",\"\",IF(ISERROR(MATCH(LoB!AJ6,List!$A$2:$A$101,0)),\"Not Available\",\"OK\"))","v":"OK"},{"$f":"IF(AJ6<>\"OK\",\"\",IF(LoB!AJ6=\"Empirical\",IF(OR(LoB!AK6=\"\",ISERROR(MATCH(LoB!AK6,Empirical!$B$1:$CW$1,0))),\"Not Available\",\"OK\"),IF(AND(VLOOKUP(LoB!AJ6,List!$A$2:$E$101,2,FALSE)<>\"\",LoB!AK6<=VLOOKUP(LoB!AJ6,List!$A$2:$E$101,2,FALSE)),\"Too Small\",IF(AND(VLOOKUP(LoB!AJ6,List!$A$2:$E$101,3,FALSE)<>\"\",LoB!AK6>=VLOOKUP(LoB!AJ6,List!$A$2:$E$101,3,FALSE)),\"Too Large\",\"OK\"))))","v":"OK"},{"$f":"IF(AJ6<>\"OK\",\"\",IF(AND(VLOOKUP(LoB!AJ6,List!$A$2:$E$101,4,FALSE)<>\"\",LoB!AL6<=VLOOKUP(LoB!AJ6,List!$A$2:$E$101,4,FALSE)),\"Too Small\",IF(AND(VLOOKUP(LoB!AJ6,List!$A$2:$E$101,5,FALSE)<>\"\",LoB!AL6>=VLOOKUP(LoB!AJ6,List!$A$2:$E$101,5,FALSE)),\"Too Large\",\"OK\")))","v":"OK"},null,{"$f":"IF(AJ6<>\"OK\",\"\",IF(AND(LoB!AM6=\"Yes\",LoB!AN6>LoB!AO6),\"Min > Max\",IF(AND(LoB!AM6=\"Yes\",NOT(ISNUMBER(LoB!AN6))),\"Not Number\",\"OK\")))","v":"OK"},{"$f":"IF(AJ6<>\"OK\",\"\",IF(AND(LoB!AM6=\"Yes\",LoB!AN6>LoB!AO6),\"Min > Max\",IF(AND(LoB!AM6=\"Yes\",NOT(ISNUMBER(LoB!AO6))),\"Not Number\",\"OK\")))","v":"OK"},{"$f":"IF($E6<>\"Yes\",\"\",IF(ISERROR(MATCH(LoB!AP6,List!$A$2:$A$101,0)),\"Not Available\",\"OK\"))","v":"OK"},{"$f":"IF(AP6<>\"OK\",\"\",IF(LoB!AP6=\"Empirical\",IF(OR(LoB!AQ6=\"\",ISERROR(MATCH(LoB!AQ6,Empirical!$B$1:$CW$1,0))),\"Not Available\",\"OK\"),IF(AND(VLOOKUP(LoB!AP6,List!$A$2:$E$101,2,FALSE)<>\"\",LoB!AQ6<=VLOOKUP(LoB!AP6,List!$A$2:$E$101,2,FALSE)),\"Too Small\",IF(AND(VLOOKUP(LoB!AP6,List!$A$2:$E$101,3,FALSE)<>\"\",LoB!AQ6>=VLOOKUP(LoB!AP6,List!$A$2:$E$101,3,FALSE)),\"Too Large\",\"OK\"))))","v":"OK"},{"$f":"IF(AP6<>\"OK\",\"\",IF(AND(VLOOKUP(LoB!AP6,List!$A$2:$E$101,4,FALSE)<>\"\",LoB!AR6<=VLOOKUP(LoB!AP6,List!$A$2:$E$101,4,FALSE)),\"Too Small\",IF(AND(VLOOKUP(LoB!AP6,List!$A$2:$E$101,5,FALSE)<>\"\",LoB!AR6>=VLOOKUP(LoB!AP6,List!$A$2:$E$101,5,FALSE)),\"Too Large\",\"OK\")))","v":"OK"},null,{"$f":"IF(AP6<>\"OK\",\"\",IF(AND(LoB!AS6=\"Yes\",LoB!AT6>LoB!AU6),\"Min > Max\",IF(AND(LoB!AS6=\"Yes\",NOT(ISNUMBER(LoB!AT6))),\"Not Number\",\"OK\")))","v":"OK"},{"$f":"IF(AP6<>\"OK\",\"\",IF(AND(LoB!AS6=\"Yes\",LoB!AT6>LoB!AU6),\"Min > Max\",IF(AND(LoB!AS6=\"Yes\",NOT(ISNUMBER(LoB!AU6))),\"Not Number\",\"OK\")))","v":"OK"},{"$f":"IF($E6<>\"Yes\",\"\",IF(ISERROR(MATCH(LoB!AV6,List!$F$2:$F$101,0)),\"Not Available\",\"OK\"))","v":"OK"},{"$f":"IF(AV6<>\"OK\",\"\",IF(LoB!AV6=\"Independent\",\"OK\",IF(OR(AND(LoB!AV6=\"clayton\",LoB!AW6<-1),AND(OR(LoB!AV6=\"gumbel\",LoB!AV6=\"joe\"),LoB!AW6<1),AND(LoB!AV6<>\"normal\",LoB!AV6<>\"t\",LoB!AW6=0)),\"Invalid Value\",IF(AND(OR(LoB!AV6=\"normal\",LoB!AV6=\"t\"),ABS(LoB!AW6)>1),\"|Correlation|>1\",IF(AND(OR(LoB!AV6=\"normal\",LoB!AV6=\"t\"),LoB!AW6=\"\"),\"No Value\",\"OK\")))))","v":"OK"},{"$f":"IF(AV6<>\"OK\",\"\",IF(LoB!AV6=\"Independent\",\"OK\", IF(AND(OR(LoB!AV6=\"normal\",LoB!AV6=\"t\"),1-LoB!AW6*LoB!AX6<0),\"Non Positive Semidefinite\",IF(ABS(LoB!AX6)>1,\"|Correlation|>1\",IF(LoB!AX6=\"\",\"No Value\",\"OK\")))))","v":"OK"},{"$f":"IF(AV6<>\"OK\",\"\",IF(AND(OR(LoB!AV6=\"normal\",LoB!AV6=\"t\"),detm(LoB!AW6,LoB!AX6,LoB!AY6)<0),\"Non Positive Semidefinite\",IF(ABS(LoB!AY6)>1,\"|Correlation >1\",IF(LoB!AY6=\"\",\"\",\"OK\"))))","v":""},{"$f":"IF(AV6<>\"OK\",\"\",IF(AND(LoB!AV6=\"t\",LoB!AZ6<=0),\"Wrong DoF\",\"OK\"))","v":"OK"},{"$f":"IF($E6<>\"Yes\",\"\",IF(OR(LoB!BA6=\"\",AND(ISERROR(MATCH(LoB!BA6,FactorTable!$B$1:$GS$1,0)),ISERROR(MATCH(LoB!BA6,Function!$C$1:$CX$1,0)))),\"Not Available\",\"OK\"))","v":"OK"},{"$f":"IF($E6<>\"Yes\",\"\",IF(OR(LoB!BB6=\"Empirical\",LoB!BB6=\"None\",LoB!BB6=\"Fixed\"),\"OK\",\"Wrong\"))","v":"OK"},{"$f":"IF(BB6<>\"OK\",\"\",IF(LoB!BB6=\"Empirical\",IF(OR(LoB!BC6=\"\",ISERROR(MATCH(LoB!BC6,Empirical!$B$1:$CW$1,0))),\"Not Available\",\"OK\"),IF(AND(LoB!BB6=\"Fixed\",LoB!BC6>=0),\"OK\",\"OK\")))","v":"OK"},{"$f":"IF($E6<>\"Yes\",\"\",IF(OR(LoB!BD6=\"Empirical\",LoB!BD6=\"None\",LoB!BB6=\"Fixed\"),\"OK\",\"Wrong\"))","v":"OK"},{"$f":"IF(BD6<>\"OK\",\"\",IF(LoB!BD6=\"Empirical\",IF(OR(LoB!BE6=\"\",ISERROR(MATCH(LoB!BE6,Empirical!$B$1:$CW$1,0))),\"Not Available\",\"OK\"),IF(AND(LoB!BD6=\"Fixed\",LoB!BE6>=0),\"OK\",\"OK\")))","v":"OK"},{"$f":"IF($E6<>\"Yes\",\"\",IF(OR(LoB!BF6=\"\",ISERROR(MATCH(LoB!BF6,List!$M$2:$M$28,0))),\"Not Available\",\"OK\"))","v":"OK"}]
[null,{"$f":"IF(COUNTIFS(F7:BF7,\"<>OK\",F7:BF7,\">\"\"\")=0,\"Correct\",\"Wrong\")","v":"Correct"},{"$f":"IF(LoB!C7=\"\",\"\",LoB!C7)","v":"Auto"},{"$f":"IF(LoB!D7=\"\",\"\",LoB!D7)","v":"PD"},{"$f":"IF(LoB!E7=\"\",\"\",LoB!E7)","v":"Yes"},{"$f":"IF($E7<>\"Yes\",\"\",IF(OR(LoB!F7=\"CondPaid\",LoB!F7=\"CondIncurLoss\"),\"OK\",IF(OR(AND(ISERROR(MATCH(LoB!F7,FactorTable!$B$1:$GS$1,0)),ISERROR(MATCH(LoB!F7,Function!$C$1:$CX$1,0)))),\"Not Available\",\"OK\")))","v":"OK"},{"$f":"IF($E7<>\"Yes\",\"\",IF(OR(LoB!G7=\"\",AND(ISERROR(MATCH(LoB!G7,FactorTable!$B$1:$GS$1,0)),ISERROR(MATCH(LoB!G7,Function!$C$1:$CX$1,0)))),\"Not Available\",\"OK\"))","v":"OK"},{"$f":"IF($E7<>\"Yes\",\"\",IF(OR(LoB!H7=\"CondPaid\",LoB!H7=\"CondIncurLoss\"),\"OK\",IF(OR(AND(ISERROR(MATCH(LoB!H7,FactorTable!$B$1:$GS$1,0)),ISERROR(MATCH(LoB!H7,Function!$C$1:$CX$1,0)))),\"Not Available\",\"OK\")))","v":"OK"},{"$f":"IF($E7<>\"Yes\",\"\",IF(ISERROR(MATCH(LoB!I7,List!$A$2:$A$101,0)),\"Not Available\",\"OK\"))","v":"OK"},{"$f":"IF(I7<>\"OK\",\"\",IF(LoB!I7=\"Empirical\",IF(OR(LoB!J7=\"\",ISERROR(MATCH(LoB!J7,Empirical!$B$1:$CW$1,0))),\"Not Available\",\"OK\"),IF(AND(VLOOKUP(LoB!I7,List!$A$2:$E$101,2,FALSE)<>\"\",LoB!J7<=VLOOKUP(LoB!I7,List!$A$2:$E$101,2,FALSE)),\"Too Small\",IF(AND(VLOOKUP(LoB!I7,List!$A$2:$E$101,3,FALSE)<>\"\",LoB!J7>=VLOOKUP(LoB!I7,List!$A$2:$E$101,3,FALSE)),\"Too Large\",\"OK\"))))","v":"OK"},{"$f":"IF(I7<>\"OK\",\"\",IF(AND(VLOOKUP(LoB!I7,List!$A$2:$E$101,4,FALSE)<>\"\",LoB!K7<=VLOOKUP(LoB!I7,List!$A$2:$E$101,4,FALSE)),\"Too Small\",IF(AND(VLOOKUP(LoB!I7,List!$A$2:$E$101,5,FALSE)<>\"\",LoB!K7>=VLOOKUP(LoB!I7,List!$A$2:$E$101,5,FALSE)),\"Too Large\",\"OK\")))","v":"OK"},null,{"$f":"IF(I7<>\"OK\",\"\",IF(AND(LoB!L7=\"Yes\",LoB!M7>LoB!N7),\"Min > Max\",IF(AND(LoB!L7=\"Yes\",NOT(ISNUMBER(LoB!M7))),\"Not Number\",\"OK\")))","v":"OK"},{"$f":"IF(I7<>\"OK\",\"\",IF(AND(LoB!L7=\"Yes\",LoB!M7>LoB!N7),\"Min > Max\",IF(AND(LoB!L7=\"Yes\",NOT(ISNUMBER(LoB!N7))),\"Not Number\",\"OK\")))","v":"OK"},{"$f":"IF($E7<>\"Yes\",\"\",IF(ISERROR(MATCH(LoB!O7,List!$A$2:$A$101,0)),\"Not Available\",\"OK\"))","v":"OK"},{"$f":"IF(O7<>\"OK\",\"\",IF(LoB!O7=\"Empirical\",IF(OR(LoB!P7=\"\",ISERROR(MATCH(LoB!P7,Empirical!$B$1:$CW$1,0))),\"Not Available\",\"OK\"),IF(AND(VLOOKUP(LoB!O7,List!$A$2:$E$101,2,FALSE)<>\"\",LoB!P7<=VLOOKUP(LoB!O7,List!$A$2:$E$101,2,FALSE)),\"Too Small\",IF(AND(VLOOKUP(LoB!O7,List!$A$2:$E$101,3,FALSE)<>\"\",LoB!P7>=VLOOKUP(LoB!O7,List!$A$2:$E$101,3,FALSE)),\"Too Large\",\"OK\"))))","v":"OK"},{"$f":"IF(O7<>\"OK\",\"\",IF(AND(VLOOKUP(LoB!O7,List!$A$2:$E$101,4,FALSE)<>\"\",LoB!Q7<=VLOOKUP(LoB!O7,List!$A$2:$E$101,4,FALSE)),\"Too Small\",IF(AND(VLOOKUP(LoB!O7,List!$A$2:$E$101,5,FALSE)<>\"\",LoB!Q7>=VLOOKUP(LoB!O7,List!$A$2:$E$101,5,FALSE)),\"Too Large\",\"OK\")))","v":"OK"},null,{"$f":"IF(O7<>\"OK\",\"\",IF(AND(LoB!R7=\"Yes\",LoB!S7>LoB!T7),\"Min > Max\",IF(AND(LoB!R7=\"Yes\",NOT(ISNUMBER(LoB!S7))),\"Not Number\",\"OK\")))","v":"OK"},{"$f":"IF(O7<>\"OK\",\"\",IF(AND(LoB!R7=\"Yes\",LoB!S7>LoB!T7),\"Min > Max\",IF(AND(LoB!R7=\"Yes\",NOT(ISNUMBER(LoB!T7))),\"Not Number\",\"OK\")))","v":"OK"},{"$f":"IF($E7<>\"Yes\",\"\",IF(OR(LoB!U7=\"\",ISERROR(MATCH(LoB!U7,Index!$B$1:$CW$1,0))),\"Not Available\",\"OK\"))","v":"OK"},{"$f":"IF($E7<>\"Yes\",\"\",IF(ISERROR(MATCH(LoB!V7,List!$A$2:$A$101,0)),\"Not Available\",\"OK\"))","v":"OK"},{"$f":"IF(V7<>\"OK\",\"\",IF(LoB!V7=\"Empirical\",IF(OR(LoB!W7=\"\",ISERROR(MATCH(LoB!W7,Empirical!$B$1:$CW$1,0))),\"Not Available\",\"OK\"),IF(AND(VLOOKUP(LoB!V7,List!$A$2:$E$101,2,FALSE)<>\"\",LoB!W7<=VLOOKUP(LoB!V7,List!$A$2:$E$101,2,FALSE)),\"Too Small\",IF(AND(VLOOKUP(LoB!V7,List!$A$2:$E$101,3,FALSE)<>\"\",LoB!W7>=VLOOKUP(LoB!V7,List!$A$2:$E$101,3,FALSE)),\"Too Large\",\"OK\"))))","v":"OK"},{"$f":"IF(V7<>\"OK\",\"\",IF(AND(VLOOKUP(LoB!V7,List!$A$2:$E$101,4,FALSE)<>\"\",LoB!X7<=VLOOKUP(LoB!V7,List!$A$2:$E$101,4,FALSE)),\"Too Small\",IF(AND(VLOOKUP(LoB!V7,List!$A$2:$E$101,5,FALSE)<>\"\",LoB!X7>=VLOOKUP(LoB!V7,List!$A$2:$E$101,5,FALSE)),\"Too Large\",\"OK\")))","v":"OK"},null,{"$f":"IF(V7<>\"OK\",\"\",IF(AND(LoB!Y7=\"Yes\",LoB!Z7>LoB!AA7),\"Min > Max\",IF(AND(LoB!Y7=\"Yes\",NOT(ISNUMBER(LoB!Z7))),\"Not Number\",\"OK\")))","v":"OK"},{"$f":"IF(V7<>\"OK\",\"\",IF(AND(LoB!Y7=\"Yes\",LoB!Z7>LoB!AA7),\"Min > Max\",IF(AND(LoB!Y7=\"Yes\",NOT(ISNUMBER(LoB!AA7))),\"Not Number\",\"OK\")))","v":"OK"},{"$f":"IF($E7<>\"Yes\",\"\",IF(OR(LoB!AB7=\"\",ISERROR(MATCH(LoB!AB7,Index!$B$1:$CW$1,0))),\"Not Available\",\"OK\"))","v":"OK"},{"$f":"IF($E7<>\"Yes\",\"\",IF(OR(LoB!AC7=\"CLOSED\",LoB!AC7=\"ALL\"),\"OK\",\"Not Available\"))","v":"OK"},{"$f":"IF($E7<>\"Yes\",\"\",IF(ISERROR(MATCH(LoB!AD7,List!$A$2:$A$101,0)),\"Not Available\",\"OK\"))","v":"OK"},{"$f":"IF(AD7<>\"OK\",\"\",IF(LoB!AD7=\"Empirical\",IF(OR(LoB!AE7=\"\",ISERROR(MATCH(LoB!AE7,Empirical!$B$1:$CW$1,0))),\"Not Available\",\"OK\"),IF(AND(VLOOKUP(LoB!AD7,List!$A$2:$E$101,2,FALSE)<>\"\",LoB!AE7<=VLOOKUP(LoB!AD7,List!$A$2:$E$101,2,FALSE)),\"Too Small\",IF(AND(VLOOKUP(LoB!AD7,List!$A$2:$E$101,3,FALSE)<>\"\",LoB!AE7>=VLOOKUP(LoB!AD7,List!$A$2:$E$101,3,FALSE)),\"Too Large\",\"OK\"))))","v":"OK"},{"$f":"IF(AD7<>\"OK\",\"\",IF(AND(VLOOKUP(LoB!AD7,List!$A$2:$E$101,4,FALSE)<>\"\",LoB!AF7<=VLOOKUP(LoB!AD7,List!$A$2:$E$101,4,FALSE)),\"Too Small\",IF(AND(VLOOKUP(LoB!AD7,List!$A$2:$E$101,5,FALSE)<>\"\",LoB!AF7>=VLOOKUP(LoB!AD7,List!$A$2:$E$101,5,FALSE)),\"Too Large\",\"OK\")))","v":"OK"},null,{"$f":"IF(AD7<>\"OK\",\"\",IF(AND(LoB!AG7=\"Yes\",LoB!AH7>LoB!AI7),\"Min > Max\",IF(AND(LoB!AG7=\"Yes\",NOT(ISNUMBER(LoB!AH7))),\"Not Number\",\"OK\")))","v":"OK"},{"$f":"IF(AD7<>\"OK\",\"\",IF(AND(LoB!AG7=\"Yes\",LoB!AH7>LoB!AI7),\"Min > Max\",IF(AND(LoB!AG7=\"Yes\",NOT(ISNUMBER(LoB!AI7))),\"Not Number\",\"OK\")))","v":"OK"},{"$f":"IF($E7<>\"Yes\",\"\",IF(ISERROR(MATCH(LoB!AJ7,List!$A$2:$A$101,0)),\"Not Available\",\"OK\"))","v":"OK"},{"$f":"IF(AJ7<>\"OK\",\"\",IF(LoB!AJ7=\"Empirical\",IF(OR(LoB!AK7=\"\",ISERROR(MATCH(LoB!AK7,Empirical!$B$1:$CW$1,0))),\"Not Available\",\"OK\"),IF(AND(VLOOKUP(LoB!AJ7,List!$A$2:$E$101,2,FALSE)<>\"\",LoB!AK7<=VLOOKUP(LoB!AJ7,List!$A$2:$E$101,2,FALSE)),\"Too Small\",IF(AND(VLOOKUP(LoB!AJ7,List!$A$2:$E$101,3,FALSE)<>\"\",LoB!AK7>=VLOOKUP(LoB!AJ7,List!$A$2:$E$101,3,FALSE)),\"Too Large\",\"OK\"))))","v":"OK"},{"$f":"IF(AJ7<>\"OK\",\"\",IF(AND(VLOOKUP(LoB!AJ7,List!$A$2:$E$101,4,FALSE)<>\"\",LoB!AL7<=VLOOKUP(LoB!AJ7,List!$A$2:$E$101,4,FALSE)),\"Too Small\",IF(AND(VLOOKUP(LoB!AJ7,List!$A$2:$E$101,5,FALSE)<>\"\",LoB!AL7>=VLOOKUP(LoB!AJ7,List!$A$2:$E$101,5,FALSE)),\"Too Large\",\"OK\")))","v":"OK"},null,{"$f":"IF(AJ7<>\"OK\",\"\",IF(AND(LoB!AM7=\"Yes\",LoB!AN7>LoB!AO7),\"Min > Max\",IF(AND(LoB!AM7=\"Yes\",NOT(ISNUMBER(LoB!AN7))),\"Not Number\",\"OK\")))","v":"OK"},{"$f":"IF(AJ7<>\"OK\",\"\",IF(AND(LoB!AM7=\"Yes\",LoB!AN7>LoB!AO7),\"Min > Max\",IF(AND(LoB!AM7=\"Yes\",NOT(ISNUMBER(LoB!AO7))),\"Not Number\",\"OK\")))","v":"OK"},{"$f":"IF($E7<>\"Yes\",\"\",IF(ISERROR(MATCH(LoB!AP7,List!$A$2:$A$101,0)),\"Not Available\",\"OK\"))","v":"OK"},{"$f":"IF(AP7<>\"OK\",\"\",IF(LoB!AP7=\"Empirical\",IF(OR(LoB!AQ7=\"\",ISERROR(MATCH(LoB!AQ7,Empirical!$B$1:$CW$1,0))),\"Not Available\",\"OK\"),IF(AND(VLOOKUP(LoB!AP7,List!$A$2:$E$101,2,FALSE)<>\"\",LoB!AQ7<=VLOOKUP(LoB!AP7,List!$A$2:$E$101,2,FALSE)),\"Too Small\",IF(AND(VLOOKUP(LoB!AP7,List!$A$2:$E$101,3,FALSE)<>\"\",LoB!AQ7>=VLOOKUP(LoB!AP7,List!$A$2:$E$101,3,FALSE)),\"Too Large\",\"OK\"))))","v":"OK"},{"$f":"IF(AP7<>\"OK\",\"\",IF(AND(VLOOKUP(LoB!AP7,List!$A$2:$E$101,4,FALSE)<>\"\",LoB!AR7<=VLOOKUP(LoB!AP7,List!$A$2:$E$101,4,FALSE)),\"Too Small\",IF(AND(VLOOKUP(LoB!AP7,List!$A$2:$E$101,5,FALSE)<>\"\",LoB!AR7>=VLOOKUP(LoB!AP7,List!$A$2:$E$101,5,FALSE)),\"Too Large\",\"OK\")))","v":"OK"},null,{"$f":"IF(AP7<>\"OK\",\"\",IF(AND(LoB!AS7=\"Yes\",LoB!AT7>LoB!AU7),\"Min > Max\",IF(AND(LoB!AS7=\"Yes\",NOT(ISNUMBER(LoB!AT7))),\"Not Number\",\"OK\")))","v":"OK"},{"$f":"IF(AP7<>\"OK\",\"\",IF(AND(LoB!AS7=\"Yes\",LoB!AT7>LoB!AU7),\"Min > Max\",IF(AND(LoB!AS7=\"Yes\",NOT(ISNUMBER(LoB!AU7))),\"Not Number\",\"OK\")))","v":"OK"},{"$f":"IF($E7<>\"Yes\",\"\",IF(ISERROR(MATCH(LoB!AV7,List!$F$2:$F$101,0)),\"Not Available\",\"OK\"))","v":"OK"},{"$f":"IF(AV7<>\"OK\",\"\",IF(LoB!AV7=\"Independent\",\"OK\",IF(OR(AND(LoB!AV7=\"clayton\",LoB!AW7<-1),AND(OR(LoB!AV7=\"gumbel\",LoB!AV7=\"joe\"),LoB!AW7<1),AND(LoB!AV7<>\"normal\",LoB!AV7<>\"t\",LoB!AW7=0)),\"Invalid Value\",IF(AND(OR(LoB!AV7=\"normal\",LoB!AV7=\"t\"),ABS(LoB!AW7)>1),\"|Correlation|>1\",IF(AND(OR(LoB!AV7=\"normal\",LoB!AV7=\"t\"),LoB!AW7=\"\"),\"No Value\",\"OK\")))))","v":"OK"},{"$f":"IF(AV7<>\"OK\",\"\",IF(LoB!AV7=\"Independent\",\"OK\", IF(AND(OR(LoB!AV7=\"normal\",LoB!AV7=\"t\"),1-LoB!AW7*LoB!AX7<0),\"Non Positive Semidefinite\",IF(ABS(LoB!AX7)>1,\"|Correlation|>1\",IF(LoB!AX7=\"\",\"No Value\",\"OK\")))))","v":"OK"},{"$f":"IF(AV7<>\"OK\",\"\",IF(AND(OR(LoB!AV7=\"normal\",LoB!AV7=\"t\"),detm(LoB!AW7,LoB!AX7,LoB!AY7)<0),\"Non Positive Semidefinite\",IF(ABS(LoB!AY7)>1,\"|Correlation >1\",IF(LoB!AY7=\"\",\"\",\"OK\"))))","v":""},{"$f":"IF(AV7<>\"OK\",\"\",IF(AND(LoB!AV7=\"t\",LoB!AZ7<=0),\"Wrong DoF\",\"OK\"))","v":"OK"},{"$f":"IF($E7<>\"Yes\",\"\",IF(OR(LoB!BA7=\"\",AND(ISERROR(MATCH(LoB!BA7,FactorTable!$B$1:$GS$1,0)),ISERROR(MATCH(LoB!BA7,Function!$C$1:$CX$1,0)))),\"Not Available\",\"OK\"))","v":"OK"},{"$f":"IF($E7<>\"Yes\",\"\",IF(OR(LoB!BB7=\"Empirical\",LoB!BB7=\"None\",LoB!BB7=\"Fixed\"),\"OK\",\"Wrong\"))","v":"OK"},{"$f":"IF(BB7<>\"OK\",\"\",IF(LoB!BB7=\"Empirical\",IF(OR(LoB!BC7=\"\",ISERROR(MATCH(LoB!BC7,Empirical!$B$1:$CW$1,0))),\"Not Available\",\"OK\"),IF(AND(LoB!BB7=\"Fixed\",LoB!BC7>=0),\"OK\",\"OK\")))","v":"OK"},{"$f":"IF($E7<>\"Yes\",\"\",IF(OR(LoB!BD7=\"Empirical\",LoB!BD7=\"None\",LoB!BB7=\"Fixed\"),\"OK\",\"Wrong\"))","v":"OK"},{"$f":"IF(BD7<>\"OK\",\"\",IF(LoB!BD7=\"Empirical\",IF(OR(LoB!BE7=\"\",ISERROR(MATCH(LoB!BE7,Empirical!$B$1:$CW$1,0))),\"Not Available\",\"OK\"),IF(AND(LoB!BD7=\"Fixed\",LoB!BE7>=0),\"OK\",\"OK\")))","v":"OK"},{"$f":"IF($E7<>\"Yes\",\"\",IF(OR(LoB!BF7=\"\",ISERROR(MATCH(LoB!BF7,List!$M$2:$M$28,0))),\"Not Available\",\"OK\"))","v":"OK"}]
[null,"Correct",{"$f":"IF(LoB!C8=\"\",\"\",LoB!C8)","v":""},{"$f":"IF(LoB!D8=\"\",\"\",LoB!D8)","v":""},{"$f":"IF(LoB!E8=\"\",\"\",LoB!E8)","v":""},{"$f":"IF($E8<>\"Yes\",\"\",IF(OR(LoB!F8=\"CondPaid\",LoB!F8=\"CondIncurLoss\"),\"OK\",IF(OR(AND(ISERROR(MATCH(LoB!F8,FactorTable!$B$1:$GS$1,0)),ISERROR(MATCH(LoB!F8,Function!$C$1:$CX$1,0)))),\"Not Available\",\"OK\")))","v":""},{"$f":"IF($E8<>\"Yes\",\"\",IF(OR(LoB!G8=\"\",AND(ISERROR(MATCH(LoB!G8,FactorTable!$B$1:$GS$1,0)),ISERROR(MATCH(LoB!G8,Function!$C$1:$CX$1,0)))),\"Not Available\",\"OK\"))","v":""},{"$f":"IF($E8<>\"Yes\",\"\",IF(OR(LoB!H8=\"CondPaid\",LoB!H8=\"CondIncurLoss\"),\"OK\",IF(OR(AND(ISERROR(MATCH(LoB!H8,FactorTable!$B$1:$GS$1,0)),ISERROR(MATCH(LoB!H8,Function!$C$1:$CX$1,0)))),\"Not Available\",\"OK\")))","v":""},{"$f":"IF($E8<>\"Yes\",\"\",IF(ISERROR(MATCH(LoB!I8,List!$A$2:$A$101,0)),\"Not Available\",\"OK\"))","v":""},{"$f":"IF(I8<>\"OK\",\"\",IF(LoB!I8=\"Empirical\",IF(OR(LoB!J8=\"\",ISERROR(MATCH(LoB!J8,Empirical!$B$1:$CW$1,0))),\"Not Available\",\"OK\"),IF(AND(VLOOKUP(LoB!I8,List!$A$2:$E$101,2,FALSE)<>\"\",LoB!J8<=VLOOKUP(LoB!I8,List!$A$2:$E$101,2,FALSE)),\"Too Small\",IF(AND(VLOOKUP(LoB!I8,List!$A$2:$E$101,3,FALSE)<>\"\",LoB!J8>=VLOOKUP(LoB!I8,List!$A$2:$E$101,3,FALSE)),\"Too Large\",\"OK\"))))","v":""},{"$f":"IF(I8<>\"OK\",\"\",IF(AND(VLOOKUP(LoB!I8,List!$A$2:$E$101,4,FALSE)<>\"\",LoB!K8<=VLOOKUP(LoB!I8,List!$A$2:$E$101,4,FALSE)),\"Too Small\",IF(AND(VLOOKUP(LoB!I8,List!$A$2:$E$101,5,FALSE)<>\"\",LoB!K8>=VLOOKUP(LoB!I8,List!$A$2:$E$101,5,FALSE)),\"Too Large\",\"OK\")))","v":""},null,{"$f":"IF(I8<>\"OK\",\"\",IF(AND(LoB!L8=\"Yes\",LoB!M8>LoB!N8),\"Min > Max\",IF(AND(LoB!L8=\"Yes\",NOT(ISNUMBER(LoB!M8))),\"Not Number\",\"OK\")))","v":""},{"$f":"IF(I8<>\"OK\",\"\",IF(AND(LoB!L8=\"Yes\",LoB!M8>LoB!N8),\"Min > Max\",IF(AND(LoB!L8=\"Yes\",NOT(ISNUMBER(LoB!N8))),\"Not Number\",\"OK\")))","v":""},{"$f":"IF($E8<>\"Yes\",\"\",IF(ISERROR(MATCH(LoB!O8,List!$A$2:$A$101,0)),\"Not Available\",\"OK\"))","v":""},{"$f":"IF(O8<>\"OK\",\"\",IF(LoB!O8=\"Empirical\",IF(OR(LoB!P8=\"\",ISERROR(MATCH(LoB!P8,Empirical!$B$1:$CW$1,0))),\"Not Available\",\"OK\"),IF(AND(VLOOKUP(LoB!O8,List!$A$2:$E$101,2,FALSE)<>\"\",LoB!P8<=VLOOKUP(LoB!O8,List!$A$2:$E$101,2,FALSE)),\"Too Small\",IF(AND(VLOOKUP(LoB!O8,List!$A$2:$E$101,3,FALSE)<>\"\",LoB!P8>=VLOOKUP(LoB!O8,List!$A$2:$E$101,3,FALSE)),\"Too Large\",\"OK\"))))","v":""},{"$f":"IF(O8<>\"OK\",\"\",IF(AND(VLOOKUP(LoB!O8,List!$A$2:$E$101,4,FALSE)<>\"\",LoB!Q8<=VLOOKUP(LoB!O8,List!$A$2:$E$101,4,FALSE)),\"Too Small\",IF(AND(VLOOKUP(LoB!O8,List!$A$2:$E$101,5,FALSE)<>\"\",LoB!Q8>=VLOOKUP(LoB!O8,List!$A$2:$E$101,5,FALSE)),\"Too Large\",\"OK\")))","v":""},null,{"$f":"IF(O8<>\"OK\",\"\",IF(AND(LoB!R8=\"Yes\",LoB!S8>LoB!T8),\"Min > Max\",IF(AND(LoB!R8=\"Yes\",NOT(ISNUMBER(LoB!S8))),\"Not Number\",\"OK\")))","v":""},{"$f":"IF(O8<>\"OK\",\"\",IF(AND(LoB!R8=\"Yes\",LoB!S8>LoB!T8),\"Min > Max\",IF(AND(LoB!R8=\"Yes\",NOT(ISNUMBER(LoB!T8))),\"Not Number\",\"OK\")))","v":""},{"$f":"IF($E8<>\"Yes\",\"\",IF(OR(LoB!U8=\"\",ISERROR(MATCH(LoB!U8,Index!$B$1:$CW$1,0))),\"Not Available\",\"OK\"))","v":""},{"$f":"IF($E8<>\"Yes\",\"\",IF(ISERROR(MATCH(LoB!V8,List!$A$2:$A$101,0)),\"Not Available\",\"OK\"))","v":""},{"$f":"IF(V8<>\"OK\",\"\",IF(LoB!V8=\"Empirical\",IF(OR(LoB!W8=\"\",ISERROR(MATCH(LoB!W8,Empirical!$B$1:$CW$1,0))),\"Not Available\",\"OK\"),IF(AND(VLOOKUP(LoB!V8,List!$A$2:$E$101,2,FALSE)<>\"\",LoB!W8<=VLOOKUP(LoB!V8,List!$A$2:$E$101,2,FALSE)),\"Too Small\",IF(AND(VLOOKUP(LoB!V8,List!$A$2:$E$101,3,FALSE)<>\"\",LoB!W8>=VLOOKUP(LoB!V8,List!$A$2:$E$101,3,FALSE)),\"Too Large\",\"OK\"))))","v":""},{"$f":"IF(V8<>\"OK\",\"\",IF(AND(VLOOKUP(LoB!V8,List!$A$2:$E$101,4,FALSE)<>\"\",LoB!X8<=VLOOKUP(LoB!V8,List!$A$2:$E$101,4,FALSE)),\"Too Small\",IF(AND(VLOOKUP(LoB!V8,List!$A$2:$E$101,5,FALSE)<>\"\",LoB!X8>=VLOOKUP(LoB!V8,List!$A$2:$E$101,5,FALSE)),\"Too Large\",\"OK\")))","v":""},null,{"$f":"IF(V8<>\"OK\",\"\",IF(AND(LoB!Y8=\"Yes\",LoB!Z8>LoB!AA8),\"Min > Max\",IF(AND(LoB!Y8=\"Yes\",NOT(ISNUMBER(LoB!Z8))),\"Not Number\",\"OK\")))","v":""},{"$f":"IF(V8<>\"OK\",\"\",IF(AND(LoB!Y8=\"Yes\",LoB!Z8>LoB!AA8),\"Min > Max\",IF(AND(LoB!Y8=\"Yes\",NOT(ISNUMBER(LoB!AA8))),\"Not Number\",\"OK\")))","v":""},{"$f":"IF($E8<>\"Yes\",\"\",IF(OR(LoB!AB8=\"\",ISERROR(MATCH(LoB!AB8,Index!$B$1:$CW$1,0))),\"Not Available\",\"OK\"))","v":""},{"$f":"IF($E8<>\"Yes\",\"\",IF(OR(LoB!AC8=\"CLOSED\",LoB!AC8=\"ALL\"),\"OK\",\"Not Available\"))","v":""},{"$f":"IF($E8<>\"Yes\",\"\",IF(ISERROR(MATCH(LoB!AD8,List!$A$2:$A$101,0)),\"Not Available\",\"OK\"))","v":""},{"$f":"IF(AD8<>\"OK\",\"\",IF(LoB!AD8=\"Empirical\",IF(OR(LoB!AE8=\"\",ISERROR(MATCH(LoB!AE8,Empirical!$B$1:$CW$1,0))),\"Not Available\",\"OK\"),IF(AND(VLOOKUP(LoB!AD8,List!$A$2:$E$101,2,FALSE)<>\"\",LoB!AE8<=VLOOKUP(LoB!AD8,List!$A$2:$E$101,2,FALSE)),\"Too Small\",IF(AND(VLOOKUP(LoB!AD8,List!$A$2:$E$101,3,FALSE)<>\"\",LoB!AE8>=VLOOKUP(LoB!AD8,List!$A$2:$E$101,3,FALSE)),\"Too Large\",\"OK\"))))","v":""},{"$f":"IF(AD8<>\"OK\",\"\",IF(AND(VLOOKUP(LoB!AD8,List!$A$2:$E$101,4,FALSE)<>\"\",LoB!AF8<=VLOOKUP(LoB!AD8,List!$A$2:$E$101,4,FALSE)),\"Too Small\",IF(AND(VLOOKUP(LoB!AD8,List!$A$2:$E$101,5,FALSE)<>\"\",LoB!AF8>=VLOOKUP(LoB!AD8,List!$A$2:$E$101,5,FALSE)),\"Too Large\",\"OK\")))","v":""},null,{"$f":"IF(AD8<>\"OK\",\"\",IF(AND(LoB!AG8=\"Yes\",LoB!AH8>LoB!AI8),\"Min > Max\",IF(AND(LoB!AG8=\"Yes\",NOT(ISNUMBER(LoB!AH8))),\"Not Number\",\"OK\")))","v":""},{"$f":"IF(AD8<>\"OK\",\"\",IF(AND(LoB!AG8=\"Yes\",LoB!AH8>LoB!AI8),\"Min > Max\",IF(AND(LoB!AG8=\"Yes\",NOT(ISNUMBER(LoB!AI8))),\"Not Number\",\"OK\")))","v":""},{"$f":"IF($E8<>\"Yes\",\"\",IF(ISERROR(MATCH(LoB!AJ8,List!$A$2:$A$101,0)),\"Not Available\",\"OK\"))","v":""},{"$f":"IF(AJ8<>\"OK\",\"\",IF(LoB!AJ8=\"Empirical\",IF(OR(LoB!AK8=\"\",ISERROR(MATCH(LoB!AK8,Empirical!$B$1:$CW$1,0))),\"Not Available\",\"OK\"),IF(AND(VLOOKUP(LoB!AJ8,List!$A$2:$E$101,2,FALSE)<>\"\",LoB!AK8<=VLOOKUP(LoB!AJ8,List!$A$2:$E$101,2,FALSE)),\"Too Small\",IF(AND(VLOOKUP(LoB!AJ8,List!$A$2:$E$101,3,FALSE)<>\"\",LoB!AK8>=VLOOKUP(LoB!AJ8,List!$A$2:$E$101,3,FALSE)),\"Too Large\",\"OK\"))))","v":""},{"$f":"IF(AJ8<>\"OK\",\"\",IF(AND(VLOOKUP(LoB!AJ8,List!$A$2:$E$101,4,FALSE)<>\"\",LoB!AL8<=VLOOKUP(LoB!AJ8,List!$A$2:$E$101,4,FALSE)),\"Too Small\",IF(AND(VLOOKUP(LoB!AJ8,List!$A$2:$E$101,5,FALSE)<>\"\",LoB!AL8>=VLOOKUP(LoB!AJ8,List!$A$2:$E$101,5,FALSE)),\"Too Large\",\"OK\")))","v":""},null,{"$f":"IF(AJ8<>\"OK\",\"\",IF(AND(LoB!AM8=\"Yes\",LoB!AN8>LoB!AO8),\"Min > Max\",IF(AND(LoB!AM8=\"Yes\",NOT(ISNUMBER(LoB!AN8))),\"Not Number\",\"OK\")))","v":""},{"$f":"IF(AJ8<>\"OK\",\"\",IF(AND(LoB!AM8=\"Yes\",LoB!AN8>LoB!AO8),\"Min > Max\",IF(AND(LoB!AM8=\"Yes\",NOT(ISNUMBER(LoB!AO8))),\"Not Number\",\"OK\")))","v":""},{"$f":"IF($E8<>\"Yes\",\"\",IF(ISERROR(MATCH(LoB!AP8,List!$A$2:$A$101,0)),\"Not Available\",\"OK\"))","v":""},{"$f":"IF(AP8<>\"OK\",\"\",IF(LoB!AP8=\"Empirical\",IF(OR(LoB!AQ8=\"\",ISERROR(MATCH(LoB!AQ8,Empirical!$B$1:$CW$1,0))),\"Not Available\",\"OK\"),IF(AND(VLOOKUP(LoB!AP8,List!$A$2:$E$101,2,FALSE)<>\"\",LoB!AQ8<=VLOOKUP(LoB!AP8,List!$A$2:$E$101,2,FALSE)),\"Too Small\",IF(AND(VLOOKUP(LoB!AP8,List!$A$2:$E$101,3,FALSE)<>\"\",LoB!AQ8>=VLOOKUP(LoB!AP8,List!$A$2:$E$101,3,FALSE)),\"Too Large\",\"OK\"))))","v":""},{"$f":"IF(AP8<>\"OK\",\"\",IF(AND(VLOOKUP(LoB!AP8,List!$A$2:$E$101,4,FALSE)<>\"\",LoB!AR8<=VLOOKUP(LoB!AP8,List!$A$2:$E$101,4,FALSE)),\"Too Small\",IF(AND(VLOOKUP(LoB!AP8,List!$A$2:$E$101,5,FALSE)<>\"\",LoB!AR8>=VLOOKUP(LoB!AP8,List!$A$2:$E$101,5,FALSE)),\"Too Large\",\"OK\")))","v":""},null,{"$f":"IF(AP8<>\"OK\",\"\",IF(AND(LoB!AS8=\"Yes\",LoB!AT8>LoB!AU8),\"Min > Max\",IF(AND(LoB!AS8=\"Yes\",NOT(ISNUMBER(LoB!AT8))),\"Not Number\",\"OK\")))","v":""},{"$f":"IF(AP8<>\"OK\",\"\",IF(AND(LoB!AS8=\"Yes\",LoB!AT8>LoB!AU8),\"Min > Max\",IF(AND(LoB!AS8=\"Yes\",NOT(ISNUMBER(LoB!AU8))),\"Not Number\",\"OK\")))","v":""},{"$f":"IF($E8<>\"Yes\",\"\",IF(ISERROR(MATCH(LoB!AV8,List!$F$2:$F$101,0)),\"Not Available\",\"OK\"))","v":""},{"$f":"IF(AV8<>\"OK\",\"\",IF(LoB!AV8=\"Independent\",\"OK\",IF(OR(AND(LoB!AV8=\"clayton\",LoB!AW8<-1),AND(OR(LoB!AV8=\"gumbel\",LoB!AV8=\"joe\"),LoB!AW8<1),AND(LoB!AV8<>\"normal\",LoB!AV8<>\"t\",LoB!AW8=0)),\"Invalid Value\",IF(AND(OR(LoB!AV8=\"normal\",LoB!AV8=\"t\"),ABS(LoB!AW8)>1),\"|Correlation|>1\",IF(AND(OR(LoB!AV8=\"normal\",LoB!AV8=\"t\"),LoB!AW8=\"\"),\"No Value\",\"OK\")))))","v":""},{"$f":"IF(AV8<>\"OK\",\"\",IF(LoB!AV8=\"Independent\",\"OK\", IF(AND(OR(LoB!AV8=\"normal\",LoB!AV8=\"t\"),1-LoB!AW8*LoB!AX8<0),\"Non Positive Semidefinite\",IF(ABS(LoB!AX8)>1,\"|Correlation|>1\",IF(LoB!AX8=\"\",\"No Value\",\"OK\")))))","v":""},{"$f":"IF(AV8<>\"OK\",\"\",IF(AND(OR(LoB!AV8=\"normal\",LoB!AV8=\"t\"),detm(LoB!AW8,LoB!AX8,LoB!AY8)<0),\"Non Positive Semidefinite\",IF(ABS(LoB!AY8)>1,\"|Correlation >1\",IF(LoB!AY8=\"\",\"\",\"OK\"))))","v":""},{"$f":"IF(AV8<>\"OK\",\"\",IF(AND(LoB!AV8=\"t\",LoB!AZ8<=0),\"Wrong DoF\",\"OK\"))","v":""},{"$f":"IF($E8<>\"Yes\",\"\",IF(OR(LoB!BA8=\"\",AND(ISERROR(MATCH(LoB!BA8,FactorTable!$B$1:$GS$1,0)),ISERROR(MATCH(LoB!BA8,Function!$C$1:$CX$1,0)))),\"Not Available\",\"OK\"))","v":""},{"$f":"IF($E8<>\"Yes\",\"\",IF(OR(LoB!BB8=\"Empirical\",LoB!BB8=\"None\",LoB!BB8=\"Fixed\"),\"OK\",\"Wrong\"))","v":""},{"$f":"IF(BB8<>\"OK\",\"\",IF(LoB!BB8=\"Empirical\",IF(OR(LoB!BC8=\"\",ISERROR(MATCH(LoB!BC8,Empirical!$B$1:$CW$1,0))),\"Not Available\",\"OK\"),IF(AND(LoB!BB8=\"Fixed\",LoB!BC8>=0),\"OK\",\"OK\")))","v":""},{"$f":"IF($E8<>\"Yes\",\"\",IF(OR(LoB!BD8=\"Empirical\",LoB!BD8=\"None\",LoB!BB8=\"Fixed\"),\"OK\",\"Wrong\"))","v":""},{"$f":"IF(BD8<>\"OK\",\"\",IF(LoB!BD8=\"Empirical\",IF(OR(LoB!BE8=\"\",ISERROR(MATCH(LoB!BE8,Empirical!$B$1:$CW$1,0))),\"Not Available\",\"OK\"),IF(AND(LoB!BD8=\"Fixed\",LoB!BE8>=0),\"OK\",\"OK\")))","v":""},{"$f":"IF($E8<>\"Yes\",\"\",IF(OR(LoB!BF8=\"\",ISERROR(MATCH(LoB!BF8,List!$M$2:$M$28,0))),\"Not Available\",\"OK\"))","v":""}]
[null,"Correct",{"$f":"IF(LoB!C9=\"\",\"\",LoB!C9)","v":""},{"$f":"IF(LoB!D9=\"\",\"\",LoB!D9)","v":""},{"$f":"IF(LoB!E9=\"\",\"\",LoB!E9)","v":""},{"$f":"IF($E9<>\"Yes\",\"\",IF(OR(LoB!F9=\"CondPaid\",LoB!F9=\"CondIncurLoss\"),\"OK\",IF(OR(AND(ISERROR(MATCH(LoB!F9,FactorTable!$B$1:$GS$1,0)),ISERROR(MATCH(LoB!F9,Function!$C$1:$CX$1,0)))),\"Not Available\",\"OK\")))","v":""},{"$f":"IF($E9<>\"Yes\",\"\",IF(OR(LoB!G9=\"\",AND(ISERROR(MATCH(LoB!G9,FactorTable!$B$1:$GS$1,0)),ISERROR(MATCH(LoB!G9,Function!$C$1:$CX$1,0)))),\"Not Available\",\"OK\"))","v":""},{"$f":"IF($E9<>\"Yes\",\"\",IF(OR(LoB!H9=\"CondPaid\",LoB!H9=\"CondIncurLoss\"),\"OK\",IF(OR(AND(ISERROR(MATCH(LoB!H9,FactorTable!$B$1:$GS$1,0)),ISERROR(MATCH(LoB!H9,Function!$C$1:$CX$1,0)))),\"Not Available\",\"OK\")))","v":""},{"$f":"IF($E9<>\"Yes\",\"\",IF(ISERROR(MATCH(LoB!I9,List!$A$2:$A$101,0)),\"Not Available\",\"OK\"))","v":""},{"$f":"IF(I9<>\"OK\",\"\",IF(LoB!I9=\"Empirical\",IF(OR(LoB!J9=\"\",ISERROR(MATCH(LoB!J9,Empirical!$B$1:$CW$1,0))),\"Not Available\",\"OK\"),IF(AND(VLOOKUP(LoB!I9,List!$A$2:$E$101,2,FALSE)<>\"\",LoB!J9<=VLOOKUP(LoB!I9,List!$A$2:$E$101,2,FALSE)),\"Too Small\",IF(AND(VLOOKUP(LoB!I9,List!$A$2:$E$101,3,FALSE)<>\"\",LoB!J9>=VLOOKUP(LoB!I9,List!$A$2:$E$101,3,FALSE)),\"Too Large\",\"OK\"))))","v":""},{"$f":"IF(I9<>\"OK\",\"\",IF(AND(VLOOKUP(LoB!I9,List!$A$2:$E$101,4,FALSE)<>\"\",LoB!K9<=VLOOKUP(LoB!I9,List!$A$2:$E$101,4,FALSE)),\"Too Small\",IF(AND(VLOOKUP(LoB!I9,List!$A$2:$E$101,5,FALSE)<>\"\",LoB!K9>=VLOOKUP(LoB!I9,List!$A$2:$E$101,5,FALSE)),\"Too Large\",\"OK\")))","v":""},null,{"$f":"IF(I9<>\"OK\",\"\",IF(AND(LoB!L9=\"Yes\",LoB!M9>LoB!N9),\"Min > Max\",IF(AND(LoB!L9=\"Yes\",NOT(ISNUMBER(LoB!M9))),\"Not Number\",\"OK\")))","v":""},{"$f":"IF(I9<>\"OK\",\"\",IF(AND(LoB!L9=\"Yes\",LoB!M9>LoB!N9),\"Min > Max\",IF(AND(LoB!L9=\"Yes\",NOT(ISNUMBER(LoB!N9))),\"Not Number\",\"OK\")))","v":""},{"$f":"IF($E9<>\"Yes\",\"\",IF(ISERROR(MATCH(LoB!O9,List!$A$2:$A$101,0)),\"Not Available\",\"OK\"))","v":""},{"$f":"IF(O9<>\"OK\",\"\",IF(LoB!O9=\"Empirical\",IF(OR(LoB!P9=\"\",ISERROR(MATCH(LoB!P9,Empirical!$B$1:$CW$1,0))),\"Not Available\",\"OK\"),IF(AND(VLOOKUP(LoB!O9,List!$A$2:$E$101,2,FALSE)<>\"\",LoB!P9<=VLOOKUP(LoB!O9,List!$A$2:$E$101,2,FALSE)),\"Too Small\",IF(AND(VLOOKUP(LoB!O9,List!$A$2:$E$101,3,FALSE)<>\"\",LoB!P9>=VLOOKUP(LoB!O9,List!$A$2:$E$101,3,FALSE)),\"Too Large\",\"OK\"))))","v":""},{"$f":"IF(O9<>\"OK\",\"\",IF(AND(VLOOKUP(LoB!O9,List!$A$2:$E$101,4,FALSE)<>\"\",LoB!Q9<=VLOOKUP(LoB!O9,List!$A$2:$E$101,4,FALSE)),\"Too Small\",IF(AND(VLOOKUP(LoB!O9,List!$A$2:$E$101,5,FALSE)<>\"\",LoB!Q9>=VLOOKUP(LoB!O9,List!$A$2:$E$101,5,FALSE)),\"Too Large\",\"OK\")))","v":""},null,{"$f":"IF(O9<>\"OK\",\"\",IF(AND(LoB!R9=\"Yes\",LoB!S9>LoB!T9),\"Min > Max\",IF(AND(LoB!R9=\"Yes\",NOT(ISNUMBER(LoB!S9))),\"Not Number\",\"OK\")))","v":""},{"$f":"IF(O9<>\"OK\",\"\",IF(AND(LoB!R9=\"Yes\",LoB!S9>LoB!T9),\"Min > Max\",IF(AND(LoB!R9=\"Yes\",NOT(ISNUMBER(LoB!T9))),\"Not Number\",\"OK\")))","v":""},{"$f":"IF($E9<>\"Yes\",\"\",IF(OR(LoB!U9=\"\",ISERROR(MATCH(LoB!U9,Index!$B$1:$CW$1,0))),\"Not Available\",\"OK\"))","v":""},{"$f":"IF($E9<>\"Yes\",\"\",IF(ISERROR(MATCH(LoB!V9,List!$A$2:$A$101,0)),\"Not Available\",\"OK\"))","v":""},{"$f":"IF(V9<>\"OK\",\"\",IF(LoB!V9=\"Empirical\",IF(OR(LoB!W9=\"\",ISERROR(MATCH(LoB!W9,Empirical!$B$1:$CW$1,0))),\"Not Available\",\"OK\"),IF(AND(VLOOKUP(LoB!V9,List!$A$2:$E$101,2,FALSE)<>\"\",LoB!W9<=VLOOKUP(LoB!V9,List!$A$2:$E$101,2,FALSE)),\"Too Small\",IF(AND(VLOOKUP(LoB!V9,List!$A$2:$E$101,3,FALSE)<>\"\",LoB!W9>=VLOOKUP(LoB!V9,List!$A$2:$E$101,3,FALSE)),\"Too Large\",\"OK\"))))","v":""},{"$f":"IF(V9<>\"OK\",\"\",IF(AND(VLOOKUP(LoB!V9,List!$A$2:$E$101,4,FALSE)<>\"\",LoB!X9<=VLOOKUP(LoB!V9,List!$A$2:$E$101,4,FALSE)),\"Too Small\",IF(AND(VLOOKUP(LoB!V9,List!$A$2:$E$101,5,FALSE)<>\"\",LoB!X9>=VLOOKUP(LoB!V9,List!$A$2:$E$101,5,FALSE)),\"Too Large\",\"OK\")))","v":""},null,{"$f":"IF(V9<>\"OK\",\"\",IF(AND(LoB!Y9=\"Yes\",LoB!Z9>LoB!AA9),\"Min > Max\",IF(AND(LoB!Y9=\"Yes\",NOT(ISNUMBER(LoB!Z9))),\"Not Number\",\"OK\")))","v":""},{"$f":"IF(V9<>\"OK\",\"\",IF(AND(LoB!Y9=\"Yes\",LoB!Z9>LoB!AA9),\"Min > Max\",IF(AND(LoB!Y9=\"Yes\",NOT(ISNUMBER(LoB!AA9))),\"Not Number\",\"OK\")))","v":""},{"$f":"IF($E9<>\"Yes\",\"\",IF(OR(LoB!AB9=\"\",ISERROR(MATCH(LoB!AB9,Index!$B$1:$CW$1,0))),\"Not Available\",\"OK\"))","v":""},{"$f":"IF($E9<>\"Yes\",\"\",IF(OR(LoB!AC9=\"CLOSED\",LoB!AC9=\"ALL\"),\"OK\",\"Not Available\"))","v":""},{"$f":"IF($E9<>\"Yes\",\"\",IF(ISERROR(MATCH(LoB!AD9,List!$A$2:$A$101,0)),\"Not Available\",\"OK\"))","v":""},{"$f":"IF(AD9<>\"OK\",\"\",IF(LoB!AD9=\"Empirical\",IF(OR(LoB!AE9=\"\",ISERROR(MATCH(LoB!AE9,Empirical!$B$1:$CW$1,0))),\"Not Available\",\"OK\"),IF(AND(VLOOKUP(LoB!AD9,List!$A$2:$E$101,2,FALSE)<>\"\",LoB!AE9<=VLOOKUP(LoB!AD9,List!$A$2:$E$101,2,FALSE)),\"Too Small\",IF(AND(VLOOKUP(LoB!AD9,List!$A$2:$E$101,3,FALSE)<>\"\",LoB!AE9>=VLOOKUP(LoB!AD9,List!$A$2:$E$101,3,FALSE)),\"Too Large\",\"OK\"))))","v":""},{"$f":"IF(AD9<>\"OK\",\"\",IF(AND(VLOOKUP(LoB!AD9,List!$A$2:$E$101,4,FALSE)<>\"\",LoB!AF9<=VLOOKUP(LoB!AD9,List!$A$2:$E$101,4,FALSE)),\"Too Small\",IF(AND(VLOOKUP(LoB!AD9,List!$A$2:$E$101,5,FALSE)<>\"\",LoB!AF9>=VLOOKUP(LoB!AD9,List!$A$2:$E$101,5,FALSE)),\"Too Large\",\"OK\")))","v":""},null,{"$f":"IF(AD9<>\"OK\",\"\",IF(AND(LoB!AG9=\"Yes\",LoB!AH9>LoB!AI9),\"Min > Max\",IF(AND(LoB!AG9=\"Yes\",NOT(ISNUMBER(LoB!AH9))),\"Not Number\",\"OK\")))","v":""},{"$f":"IF(AD9<>\"OK\",\"\",IF(AND(LoB!AG9=\"Yes\",LoB!AH9>LoB!AI9),\"Min > Max\",IF(AND(LoB!AG9=\"Yes\",NOT(ISNUMBER(LoB!AI9))),\"Not Number\",\"OK\")))","v":""},{"$f":"IF($E9<>\"Yes\",\"\",IF(ISERROR(MATCH(LoB!AJ9,List!$A$2:$A$101,0)),\"Not Available\",\"OK\"))","v":""},{"$f":"IF(AJ9<>\"OK\",\"\",IF(LoB!AJ9=\"Empirical\",IF(OR(LoB!AK9=\"\",ISERROR(MATCH(LoB!AK9,Empirical!$B$1:$CW$1,0))),\"Not Available\",\"OK\"),IF(AND(VLOOKUP(LoB!AJ9,List!$A$2:$E$101,2,FALSE)<>\"\",LoB!AK9<=VLOOKUP(LoB!AJ9,List!$A$2:$E$101,2,FALSE)),\"Too Small\",IF(AND(VLOOKUP(LoB!AJ9,List!$A$2:$E$101,3,FALSE)<>\"\",LoB!AK9>=VLOOKUP(LoB!AJ9,List!$A$2:$E$101,3,FALSE)),\"Too Large\",\"OK\"))))","v":""},{"$f":"IF(AJ9<>\"OK\",\"\",IF(AND(VLOOKUP(LoB!AJ9,List!$A$2:$E$101,4,FALSE)<>\"\",LoB!AL9<=VLOOKUP(LoB!AJ9,List!$A$2:$E$101,4,FALSE)),\"Too Small\",IF(AND(VLOOKUP(LoB!AJ9,List!$A$2:$E$101,5,FALSE)<>\"\",LoB!AL9>=VLOOKUP(LoB!AJ9,List!$A$2:$E$101,5,FALSE)),\"Too Large\",\"OK\")))","v":""},null,{"$f":"IF(AJ9<>\"OK\",\"\",IF(AND(LoB!AM9=\"Yes\",LoB!AN9>LoB!AO9),\"Min > Max\",IF(AND(LoB!AM9=\"Yes\",NOT(ISNUMBER(LoB!AN9))),\"Not Number\",\"OK\")))","v":""},{"$f":"IF(AJ9<>\"OK\",\"\",IF(AND(LoB!AM9=\"Yes\",LoB!AN9>LoB!AO9),\"Min > Max\",IF(AND(LoB!AM9=\"Yes\",NOT(ISNUMBER(LoB!AO9))),\"Not Number\",\"OK\")))","v":""},{"$f":"IF($E9<>\"Yes\",\"\",IF(ISERROR(MATCH(LoB!AP9,List!$A$2:$A$101,0)),\"Not Available\",\"OK\"))","v":""},{"$f":"IF(AP9<>\"OK\",\"\",IF(LoB!AP9=\"Empirical\",IF(OR(LoB!AQ9=\"\",ISERROR(MATCH(LoB!AQ9,Empirical!$B$1:$CW$1,0))),\"Not Available\",\"OK\"),IF(AND(VLOOKUP(LoB!AP9,List!$A$2:$E$101,2,FALSE)<>\"\",LoB!AQ9<=VLOOKUP(LoB!AP9,List!$A$2:$E$101,2,FALSE)),\"Too Small\",IF(AND(VLOOKUP(LoB!AP9,List!$A$2:$E$101,3,FALSE)<>\"\",LoB!AQ9>=VLOOKUP(LoB!AP9,List!$A$2:$E$101,3,FALSE)),\"Too Large\",\"OK\"))))","v":""},{"$f":"IF(AP9<>\"OK\",\"\",IF(AND(VLOOKUP(LoB!AP9,List!$A$2:$E$101,4,FALSE)<>\"\",LoB!AR9<=VLOOKUP(LoB!AP9,List!$A$2:$E$101,4,FALSE)),\"Too Small\",IF(AND(VLOOKUP(LoB!AP9,List!$A$2:$E$101,5,FALSE)<>\"\",LoB!AR9>=VLOOKUP(LoB!AP9,List!$A$2:$E$101,5,FALSE)),\"Too Large\",\"OK\")))","v":""},null,{"$f":"IF(AP9<>\"OK\",\"\",IF(AND(LoB!AS9=\"Yes\",LoB!AT9>LoB!AU9),\"Min > Max\",IF(AND(LoB!AS9=\"Yes\",NOT(ISNUMBER(LoB!AT9))),\"Not Number\",\"OK\")))","v":""},{"$f":"IF(AP9<>\"OK\",\"\",IF(AND(LoB!AS9=\"Yes\",LoB!AT9>LoB!AU9),\"Min > Max\",IF(AND(LoB!AS9=\"Yes\",NOT(ISNUMBER(LoB!AU9))),\"Not Number\",\"OK\")))","v":""},{"$f":"IF($E9<>\"Yes\",\"\",IF(ISERROR(MATCH(LoB!AV9,List!$F$2:$F$101,0)),\"Not Available\",\"OK\"))","v":""},{"$f":"IF(AV9<>\"OK\",\"\",IF(LoB!AV9=\"Independent\",\"OK\",IF(OR(AND(LoB!AV9=\"clayton\",LoB!AW9<-1),AND(OR(LoB!AV9=\"gumbel\",LoB!AV9=\"joe\"),LoB!AW9<1),AND(LoB!AV9<>\"normal\",LoB!AV9<>\"t\",LoB!AW9=0)),\"Invalid Value\",IF(AND(OR(LoB!AV9=\"normal\",LoB!AV9=\"t\"),ABS(LoB!AW9)>1),\"|Correlation|>1\",IF(AND(OR(LoB!AV9=\"normal\",LoB!AV9=\"t\"),LoB!AW9=\"\"),\"No Value\",\"OK\")))))","v":""},{"$f":"IF(AV9<>\"OK\",\"\",IF(LoB!AV9=\"Independent\",\"OK\", IF(AND(OR(LoB!AV9=\"normal\",LoB!AV9=\"t\"),1-LoB!AW9*LoB!AX9<0),\"Non Positive Semidefinite\",IF(ABS(LoB!AX9)>1,\"|Correlation|>1\",IF(LoB!AX9=\"\",\"No Value\",\"OK\")))))","v":""},{"$f":"IF(AV9<>\"OK\",\"\",IF(AND(OR(LoB!AV9=\"normal\",LoB!AV9=\"t\"),detm(LoB!AW9,LoB!AX9,LoB!AY9)<0),\"Non Positive Semidefinite\",IF(ABS(LoB!AY9)>1,\"|Correlation >1\",IF(LoB!AY9=\"\",\"\",\"OK\"))))","v":""},{"$f":"IF(AV9<>\"OK\",\"\",IF(AND(LoB!AV9=\"t\",LoB!AZ9<=0),\"Wrong DoF\",\"OK\"))","v":""},{"$f":"IF($E9<>\"Yes\",\"\",IF(OR(LoB!BA9=\"\",AND(ISERROR(MATCH(LoB!BA9,FactorTable!$B$1:$GS$1,0)),ISERROR(MATCH(LoB!BA9,Function!$C$1:$CX$1,0)))),\"Not Available\",\"OK\"))","v":""},{"$f":"IF($E9<>\"Yes\",\"\",IF(OR(LoB!BB9=\"Empirical\",LoB!BB9=\"None\",LoB!BB9=\"Fixed\"),\"OK\",\"Wrong\"))","v":""},{"$f":"IF(BB9<>\"OK\",\"\",IF(LoB!BB9=\"Empirical\",IF(OR(LoB!BC9=\"\",ISERROR(MATCH(LoB!BC9,Empirical!$B$1:$CW$1,0))),\"Not Available\",\"OK\"),IF(AND(LoB!BB9=\"Fixed\",LoB!BC9>=0),\"OK\",\"OK\")))","v":""},{"$f":"IF($E9<>\"Yes\",\"\",IF(OR(LoB!BD9=\"Empirical\",LoB!BD9=\"None\",LoB!BB9=\"Fixed\"),\"OK\",\"Wrong\"))","v":""},{"$f":"IF(BD9<>\"OK\",\"\",IF(LoB!BD9=\"Empirical\",IF(OR(LoB!BE9=\"\",ISERROR(MATCH(LoB!BE9,Empirical!$B$1:$CW$1,0))),\"Not Available\",\"OK\"),IF(AND(LoB!BD9=\"Fixed\",LoB!BE9>=0),\"OK\",\"OK\")))","v":""},{"$f":"IF($E9<>\"Yes\",\"\",IF(OR(LoB!BF9=\"\",ISERROR(MATCH(LoB!BF9,List!$M$2:$M$28,0))),\"Not Available\",\"OK\"))","v":""}]
[null,"Correct",{"$f":"IF(LoB!C10=\"\",\"\",LoB!C10)","v":""},{"$f":"IF(LoB!D10=\"\",\"\",LoB!D10)","v":""},{"$f":"IF(LoB!E10=\"\",\"\",LoB!E10)","v":""},{"$f":"IF($E10<>\"Yes\",\"\",IF(OR(LoB!F10=\"CondPaid\",LoB!F10=\"CondIncurLoss\"),\"OK\",IF(OR(AND(ISERROR(MATCH(LoB!F10,FactorTable!$B$1:$GS$1,0)),ISERROR(MATCH(LoB!F10,Function!$C$1:$CX$1,0)))),\"Not Available\",\"OK\")))","v":""},{"$f":"IF($E10<>\"Yes\",\"\",IF(OR(LoB!G10=\"\",AND(ISERROR(MATCH(LoB!G10,FactorTable!$B$1:$GS$1,0)),ISERROR(MATCH(LoB!G10,Function!$C$1:$CX$1,0)))),\"Not Available\",\"OK\"))","v":""},{"$f":"IF($E10<>\"Yes\",\"\",IF(OR(LoB!H10=\"CondPaid\",LoB!H10=\"CondIncurLoss\"),\"OK\",IF(OR(AND(ISERROR(MATCH(LoB!H10,FactorTable!$B$1:$GS$1,0)),ISERROR(MATCH(LoB!H10,Function!$C$1:$CX$1,0)))),\"Not Available\",\"OK\")))","v":""},{"$f":"IF($E10<>\"Yes\",\"\",IF(ISERROR(MATCH(LoB!I10,List!$A$2:$A$101,0)),\"Not Available\",\"OK\"))","v":""},{"$f":"IF(I10<>\"OK\",\"\",IF(LoB!I10=\"Empirical\",IF(OR(LoB!J10=\"\",ISERROR(MATCH(LoB!J10,Empirical!$B$1:$CW$1,0))),\"Not Available\",\"OK\"),IF(AND(VLOOKUP(LoB!I10,List!$A$2:$E$101,2,FALSE)<>\"\",LoB!J10<=VLOOKUP(LoB!I10,List!$A$2:$E$101,2,FALSE)),\"Too Small\",IF(AND(VLOOKUP(LoB!I10,List!$A$2:$E$101,3,FALSE)<>\"\",LoB!J10>=VLOOKUP(LoB!I10,List!$A$2:$E$101,3,FALSE)),\"Too Large\",\"OK\"))))","v":""},{"$f":"IF(I10<>\"OK\",\"\",IF(AND(VLOOKUP(LoB!I10,List!$A$2:$E$101,4,FALSE)<>\"\",LoB!K10<=VLOOKUP(LoB!I10,List!$A$2:$E$101,4,FALSE)),\"Too Small\",IF(AND(VLOOKUP(LoB!I10,List!$A$2:$E$101,5,FALSE)<>\"\",LoB!K10>=VLOOKUP(LoB!I10,List!$A$2:$E$101,5,FALSE)),\"Too Large\",\"OK\")))","v":""},null,{"$f":"IF(I10<>\"OK\",\"\",IF(AND(LoB!L10=\"Yes\",LoB!M10>LoB!N10),\"Min > Max\",IF(AND(LoB!L10=\"Yes\",NOT(ISNUMBER(LoB!M10))),\"Not Number\",\"OK\")))","v":""},{"$f":"IF(I10<>\"OK\",\"\",IF(AND(LoB!L10=\"Yes\",LoB!M10>LoB!N10),\"Min > Max\",IF(AND(LoB!L10=\"Yes\",NOT(ISNUMBER(LoB!N10))),\"Not Number\",\"OK\")))","v":""},{"$f":"IF($E10<>\"Yes\",\"\",IF(ISERROR(MATCH(LoB!O10,List!$A$2:$A$101,0)),\"Not Available\",\"OK\"))","v":""},{"$f":"IF(O10<>\"OK\",\"\",IF(LoB!O10=\"Empirical\",IF(OR(LoB!P10=\"\",ISERROR(MATCH(LoB!P10,Empirical!$B$1:$CW$1,0))),\"Not Available\",\"OK\"),IF(AND(VLOOKUP(LoB!O10,List!$A$2:$E$101,2,FALSE)<>\"\",LoB!P10<=VLOOKUP(LoB!O10,List!$A$2:$E$101,2,FALSE)),\"Too Small\",IF(AND(VLOOKUP(LoB!O10,List!$A$2:$E$101,3,FALSE)<>\"\",LoB!P10>=VLOOKUP(LoB!O10,List!$A$2:$E$101,3,FALSE)),\"Too Large\",\"OK\"))))","v":""},{"$f":"IF(O10<>\"OK\",\"\",IF(AND(VLOOKUP(LoB!O10,List!$A$2:$E$101,4,FALSE)<>\"\",LoB!Q10<=VLOOKUP(LoB!O10,List!$A$2:$E$101,4,FALSE)),\"Too Small\",IF(AND(VLOOKUP(LoB!O10,List!$A$2:$E$101,5,FALSE)<>\"\",LoB!Q10>=VLOOKUP(LoB!O10,List!$A$2:$E$101,5,FALSE)),\"Too Large\",\"OK\")))","v":""},null,{"$f":"IF(O10<>\"OK\",\"\",IF(AND(LoB!R10=\"Yes\",LoB!S10>LoB!T10),\"Min > Max\",IF(AND(LoB!R10=\"Yes\",NOT(ISNUMBER(LoB!S10))),\"Not Number\",\"OK\")))","v":""},{"$f":"IF(O10<>\"OK\",\"\",IF(AND(LoB!R10=\"Yes\",LoB!S10>LoB!T10),\"Min > Max\",IF(AND(LoB!R10=\"Yes\",NOT(ISNUMBER(LoB!T10))),\"Not Number\",\"OK\")))","v":""},{"$f":"IF($E10<>\"Yes\",\"\",IF(OR(LoB!U10=\"\",ISERROR(MATCH(LoB!U10,Index!$B$1:$CW$1,0))),\"Not Available\",\"OK\"))","v":""},{"$f":"IF($E10<>\"Yes\",\"\",IF(ISERROR(MATCH(LoB!V10,List!$A$2:$A$101,0)),\"Not Available\",\"OK\"))","v":""},{"$f":"IF(V10<>\"OK\",\"\",IF(LoB!V10=\"Empirical\",IF(OR(LoB!W10=\"\",ISERROR(MATCH(LoB!W10,Empirical!$B$1:$CW$1,0))),\"Not Available\",\"OK\"),IF(AND(VLOOKUP(LoB!V10,List!$A$2:$E$101,2,FALSE)<>\"\",LoB!W10<=VLOOKUP(LoB!V10,List!$A$2:$E$101,2,FALSE)),\"Too Small\",IF(AND(VLOOKUP(LoB!V10,List!$A$2:$E$101,3,FALSE)<>\"\",LoB!W10>=VLOOKUP(LoB!V10,List!$A$2:$E$101,3,FALSE)),\"Too Large\",\"OK\"))))","v":""},{"$f":"IF(V10<>\"OK\",\"\",IF(AND(VLOOKUP(LoB!V10,List!$A$2:$E$101,4,FALSE)<>\"\",LoB!X10<=VLOOKUP(LoB!V10,List!$A$2:$E$101,4,FALSE)),\"Too Small\",IF(AND(VLOOKUP(LoB!V10,List!$A$2:$E$101,5,FALSE)<>\"\",LoB!X10>=VLOOKUP(LoB!V10,List!$A$2:$E$101,5,FALSE)),\"Too Large\",\"OK\")))","v":""},null,{"$f":"IF(V10<>\"OK\",\"\",IF(AND(LoB!Y10=\"Yes\",LoB!Z10>LoB!AA10),\"Min > Max\",IF(AND(LoB!Y10=\"Yes\",NOT(ISNUMBER(LoB!Z10))),\"Not Number\",\"OK\")))","v":""},{"$f":"IF(V10<>\"OK\",\"\",IF(AND(LoB!Y10=\"Yes\",LoB!Z10>LoB!AA10),\"Min > Max\",IF(AND(LoB!Y10=\"Yes\",NOT(ISNUMBER(LoB!AA10))),\"Not Number\",\"OK\")))","v":""},{"$f":"IF($E10<>\"Yes\",\"\",IF(OR(LoB!AB10=\"\",ISERROR(MATCH(LoB!AB10,Index!$B$1:$CW$1,0))),\"Not Available\",\"OK\"))","v":""},{"$f":"IF($E10<>\"Yes\",\"\",IF(OR(LoB!AC10=\"CLOSED\",LoB!AC10=\"ALL\"),\"OK\",\"Not Available\"))","v":""},{"$f":"IF($E10<>\"Yes\",\"\",IF(ISERROR(MATCH(LoB!AD10,List!$A$2:$A$101,0)),\"Not Available\",\"OK\"))","v":""},{"$f":"IF(AD10<>\"OK\",\"\",IF(LoB!AD10=\"Empirical\",IF(OR(LoB!AE10=\"\",ISERROR(MATCH(LoB!AE10,Empirical!$B$1:$CW$1,0))),\"Not Available\",\"OK\"),IF(AND(VLOOKUP(LoB!AD10,List!$A$2:$E$101,2,FALSE)<>\"\",LoB!AE10<=VLOOKUP(LoB!AD10,List!$A$2:$E$101,2,FALSE)),\"Too Small\",IF(AND(VLOOKUP(LoB!AD10,List!$A$2:$E$101,3,FALSE)<>\"\",LoB!AE10>=VLOOKUP(LoB!AD10,List!$A$2:$E$101,3,FALSE)),\"Too Large\",\"OK\"))))","v":""},{"$f":"IF(AD10<>\"OK\",\"\",IF(AND(VLOOKUP(LoB!AD10,List!$A$2:$E$101,4,FALSE)<>\"\",LoB!AF10<=VLOOKUP(LoB!AD10,List!$A$2:$E$101,4,FALSE)),\"Too Small\",IF(AND(VLOOKUP(LoB!AD10,List!$A$2:$E$101,5,FALSE)<>\"\",LoB!AF10>=VLOOKUP(LoB!AD10,List!$A$2:$E$101,5,FALSE)),\"Too Large\",\"OK\")))","v":""},null,{"$f":"IF(AD10<>\"OK\",\"\",IF(AND(LoB!AG10=\"Yes\",LoB!AH10>LoB!AI10),\"Min > Max\",IF(AND(LoB!AG10=\"Yes\",NOT(ISNUMBER(LoB!AH10))),\"Not Number\",\"OK\")))","v":""},{"$f":"IF(AD10<>\"OK\",\"\",IF(AND(LoB!AG10=\"Yes\",LoB!AH10>LoB!AI10),\"Min > Max\",IF(AND(LoB!AG10=\"Yes\",NOT(ISNUMBER(LoB!AI10))),\"Not Number\",\"OK\")))","v":""},{"$f":"IF($E10<>\"Yes\",\"\",IF(ISERROR(MATCH(LoB!AJ10,List!$A$2:$A$101,0)),\"Not Available\",\"OK\"))","v":""},{"$f":"IF(AJ10<>\"OK\",\"\",IF(LoB!AJ10=\"Empirical\",IF(OR(LoB!AK10=\"\",ISERROR(MATCH(LoB!AK10,Empirical!$B$1:$CW$1,0))),\"Not Available\",\"OK\"),IF(AND(VLOOKUP(LoB!AJ10,List!$A$2:$E$101,2,FALSE)<>\"\",LoB!AK10<=VLOOKUP(LoB!AJ10,List!$A$2:$E$101,2,FALSE)),\"Too Small\",IF(AND(VLOOKUP(LoB!AJ10,List!$A$2:$E$101,3,FALSE)<>\"\",LoB!AK10>=VLOOKUP(LoB!AJ10,List!$A$2:$E$101,3,FALSE)),\"Too Large\",\"OK\"))))","v":""},{"$f":"IF(AJ10<>\"OK\",\"\",IF(AND(VLOOKUP(LoB!AJ10,List!$A$2:$E$101,4,FALSE)<>\"\",LoB!AL10<=VLOOKUP(LoB!AJ10,List!$A$2:$E$101,4,FALSE)),\"Too Small\",IF(AND(VLOOKUP(LoB!AJ10,List!$A$2:$E$101,5,FALSE)<>\"\",LoB!AL10>=VLOOKUP(LoB!AJ10,List!$A$2:$E$101,5,FALSE)),\"Too Large\",\"OK\")))","v":""},null,{"$f":"IF(AJ10<>\"OK\",\"\",IF(AND(LoB!AM10=\"Yes\",LoB!AN10>LoB!AO10),\"Min > Max\",IF(AND(LoB!AM10=\"Yes\",NOT(ISNUMBER(LoB!AN10))),\"Not Number\",\"OK\")))","v":""},{"$f":"IF(AJ10<>\"OK\",\"\",IF(AND(LoB!AM10=\"Yes\",LoB!AN10>LoB!AO10),\"Min > Max\",IF(AND(LoB!AM10=\"Yes\",NOT(ISNUMBER(LoB!AO10))),\"Not Number\",\"OK\")))","v":""},{"$f":"IF($E10<>\"Yes\",\"\",IF(ISERROR(MATCH(LoB!AP10,List!$A$2:$A$101,0)),\"Not Available\",\"OK\"))","v":""},{"$f":"IF(AP10<>\"OK\",\"\",IF(LoB!AP10=\"Empirical\",IF(OR(LoB!AQ10=\"\",ISERROR(MATCH(LoB!AQ10,Empirical!$B$1:$CW$1,0))),\"Not Available\",\"OK\"),IF(AND(VLOOKUP(LoB!AP10,List!$A$2:$E$101,2,FALSE)<>\"\",LoB!AQ10<=VLOOKUP(LoB!AP10,List!$A$2:$E$101,2,FALSE)),\"Too Small\",IF(AND(VLOOKUP(LoB!AP10,List!$A$2:$E$101,3,FALSE)<>\"\",LoB!AQ10>=VLOOKUP(LoB!AP10,List!$A$2:$E$101,3,FALSE)),\"Too Large\",\"OK\"))))","v":""},{"$f":"IF(AP10<>\"OK\",\"\",IF(AND(VLOOKUP(LoB!AP10,List!$A$2:$E$101,4,FALSE)<>\"\",LoB!AR10<=VLOOKUP(LoB!AP10,List!$A$2:$E$101,4,FALSE)),\"Too Small\",IF(AND(VLOOKUP(LoB!AP10,List!$A$2:$E$101,5,FALSE)<>\"\",LoB!AR10>=VLOOKUP(LoB!AP10,List!$A$2:$E$101,5,FALSE)),\"Too Large\",\"OK\")))","v":""},null,{"$f":"IF(AP10<>\"OK\",\"\",IF(AND(LoB!AS10=\"Yes\",LoB!AT10>LoB!AU10),\"Min > Max\",IF(AND(LoB!AS10=\"Yes\",NOT(ISNUMBER(LoB!AT10))),\"Not Number\",\"OK\")))","v":""},{"$f":"IF(AP10<>\"OK\",\"\",IF(AND(LoB!AS10=\"Yes\",LoB!AT10>LoB!AU10),\"Min > Max\",IF(AND(LoB!AS10=\"Yes\",NOT(ISNUMBER(LoB!AU10))),\"Not Number\",\"OK\")))","v":""},{"$f":"IF($E10<>\"Yes\",\"\",IF(ISERROR(MATCH(LoB!AV10,List!$F$2:$F$101,0)),\"Not Available\",\"OK\"))","v":""},{"$f":"IF(AV10<>\"OK\",\"\",IF(LoB!AV10=\"Independent\",\"OK\",IF(OR(AND(LoB!AV10=\"clayton\",LoB!AW10<-1),AND(OR(LoB!AV10=\"gumbel\",LoB!AV10=\"joe\"),LoB!AW10<1),AND(LoB!AV10<>\"normal\",LoB!AV10<>\"t\",LoB!AW10=0)),\"Invalid Value\",IF(AND(OR(LoB!AV10=\"normal\",LoB!AV10=\"t\"),ABS(LoB!AW10)>1),\"|Correlation|>1\",IF(AND(OR(LoB!AV10=\"normal\",LoB!AV10=\"t\"),LoB!AW10=\"\"),\"No Value\",\"OK\")))))","v":""},{"$f":"IF(AV10<>\"OK\",\"\",IF(LoB!AV10=\"Independent\",\"OK\", IF(AND(OR(LoB!AV10=\"normal\",LoB!AV10=\"t\"),1-LoB!AW10*LoB!AX10<0),\"Non Positive Semidefinite\",IF(ABS(LoB!AX10)>1,\"|Correlation|>1\",IF(LoB!AX10=\"\",\"No Value\",\"OK\")))))","v":""},{"$f":"IF(AV10<>\"OK\",\"\",IF(AND(OR(LoB!AV10=\"normal\",LoB!AV10=\"t\"),detm(LoB!AW10,LoB!AX10,LoB!AY10)<0),\"Non Positive Semidefinite\",IF(ABS(LoB!AY10)>1,\"|Correlation >1\",IF(LoB!AY10=\"\",\"\",\"OK\"))))","v":""},{"$f":"IF(AV10<>\"OK\",\"\",IF(AND(LoB!AV10=\"t\",LoB!AZ10<=0),\"Wrong DoF\",\"OK\"))","v":""},{"$f":"IF($E10<>\"Yes\",\"\",IF(OR(LoB!BA10=\"\",AND(ISERROR(MATCH(LoB!BA10,FactorTable!$B$1:$GS$1,0)),ISERROR(MATCH(LoB!BA10,Function!$C$1:$CX$1,0)))),\"Not Available\",\"OK\"))","v":""},{"$f":"IF($E10<>\"Yes\",\"\",IF(OR(LoB!BB10=\"Empirical\",LoB!BB10=\"None\",LoB!BB10=\"Fixed\"),\"OK\",\"Wrong\"))","v":""},{"$f":"IF(BB10<>\"OK\",\"\",IF(LoB!BB10=\"Empirical\",IF(OR(LoB!BC10=\"\",ISERROR(MATCH(LoB!BC10,Empirical!$B$1:$CW$1,0))),\"Not Available\",\"OK\"),IF(AND(LoB!BB10=\"Fixed\",LoB!BC10>=0),\"OK\",\"OK\")))","v":""},{"$f":"IF($E10<>\"Yes\",\"\",IF(OR(LoB!BD10=\"Empirical\",LoB!BD10=\"None\",LoB!BB10=\"Fixed\"),\"OK\",\"Wrong\"))","v":""},{"$f":"IF(BD10<>\"OK\",\"\",IF(LoB!BD10=\"Empirical\",IF(OR(LoB!BE10=\"\",ISERROR(MATCH(LoB!BE10,Empirical!$B$1:$CW$1,0))),\"Not Available\",\"OK\"),IF(AND(LoB!BD10=\"Fixed\",LoB!BE10>=0),\"OK\",\"OK\")))","v":""},{"$f":"IF($E10<>\"Yes\",\"\",IF(OR(LoB!BF10=\"\",ISERROR(MATCH(LoB!BF10,List!$M$2:$M$28,0))),\"Not Available\",\"OK\"))","v":""}]
[null,"Correct",{"$f":"IF(LoB!C11=\"\",\"\",LoB!C11)","v":""},{"$f":"IF(LoB!D11=\"\",\"\",LoB!D11)","v":""},{"$f":"IF(LoB!E11=\"\",\"\",LoB!E11)","v":""},{"$f":"IF($E11<>\"Yes\",\"\",IF(OR(LoB!F11=\"CondPaid\",LoB!F11=\"CondIncurLoss\"),\"OK\",IF(OR(AND(ISERROR(MATCH(LoB!F11,FactorTable!$B$1:$GS$1,0)),ISERROR(MATCH(LoB!F11,Function!$C$1:$CX$1,0)))),\"Not Available\",\"OK\")))","v":""},{"$f":"IF($E11<>\"Yes\",\"\",IF(OR(LoB!G11=\"\",AND(ISERROR(MATCH(LoB!G11,FactorTable!$B$1:$GS$1,0)),ISERROR(MATCH(LoB!G11,Function!$C$1:$CX$1,0)))),\"Not Available\",\"OK\"))","v":""},{"$f":"IF($E11<>\"Yes\",\"\",IF(OR(LoB!H11=\"CondPaid\",LoB!H11=\"CondIncurLoss\"),\"OK\",IF(OR(AND(ISERROR(MATCH(LoB!H11,FactorTable!$B$1:$GS$1,0)),ISERROR(MATCH(LoB!H11,Function!$C$1:$CX$1,0)))),\"Not Available\",\"OK\")))","v":""},{"$f":"IF($E11<>\"Yes\",\"\",IF(ISERROR(MATCH(LoB!I11,List!$A$2:$A$101,0)),\"Not Available\",\"OK\"))","v":""},{"$f":"IF(I11<>\"OK\",\"\",IF(LoB!I11=\"Empirical\",IF(OR(LoB!J11=\"\",ISERROR(MATCH(LoB!J11,Empirical!$B$1:$CW$1,0))),\"Not Available\",\"OK\"),IF(AND(VLOOKUP(LoB!I11,List!$A$2:$E$101,2,FALSE)<>\"\",LoB!J11<=VLOOKUP(LoB!I11,List!$A$2:$E$101,2,FALSE)),\"Too Small\",IF(AND(VLOOKUP(LoB!I11,List!$A$2:$E$101,3,FALSE)<>\"\",LoB!J11>=VLOOKUP(LoB!I11,List!$A$2:$E$101,3,FALSE)),\"Too Large\",\"OK\"))))","v":""},{"$f":"IF(I11<>\"OK\",\"\",IF(AND(VLOOKUP(LoB!I11,List!$A$2:$E$101,4,FALSE)<>\"\",LoB!K11<=VLOOKUP(LoB!I11,List!$A$2:$E$101,4,FALSE)),\"Too Small\",IF(AND(VLOOKUP(LoB!I11,List!$A$2:$E$101,5,FALSE)<>\"\",LoB!K11>=VLOOKUP(LoB!I11,List!$A$2:$E$101,5,FALSE)),\"Too Large\",\"OK\")))","v":""},null,{"$f":"IF(I11<>\"OK\",\"\",IF(AND(LoB!L11=\"Yes\",LoB!M11>LoB!N11),\"Min > Max\",IF(AND(LoB!L11=\"Yes\",NOT(ISNUMBER(LoB!M11))),\"Not Number\",\"OK\")))","v":""},{"$f":"IF(I11<>\"OK\",\"\",IF(AND(LoB!L11=\"Yes\",LoB!M11>LoB!N11),\"Min > Max\",IF(AND(LoB!L11=\"Yes\",NOT(ISNUMBER(LoB!N11))),\"Not Number\",\"OK\")))","v":""},{"$f":"IF($E11<>\"Yes\",\"\",IF(ISERROR(MATCH(LoB!O11,List!$A$2:$A$101,0)),\"Not Available\",\"OK\"))","v":""},{"$f":"IF(O11<>\"OK\",\"\",IF(LoB!O11=\"Empirical\",IF(OR(LoB!P11=\"\",ISERROR(MATCH(LoB!P11,Empirical!$B$1:$CW$1,0))),\"Not Available\",\"OK\"),IF(AND(VLOOKUP(LoB!O11,List!$A$2:$E$101,2,FALSE)<>\"\",LoB!P11<=VLOOKUP(LoB!O11,List!$A$2:$E$101,2,FALSE)),\"Too Small\",IF(AND(VLOOKUP(LoB!O11,List!$A$2:$E$101,3,FALSE)<>\"\",LoB!P11>=VLOOKUP(LoB!O11,List!$A$2:$E$101,3,FALSE)),\"Too Large\",\"OK\"))))","v":""},{"$f":"IF(O11<>\"OK\",\"\",IF(AND(VLOOKUP(LoB!O11,List!$A$2:$E$101,4,FALSE)<>\"\",LoB!Q11<=VLOOKUP(LoB!O11,List!$A$2:$E$101,4,FALSE)),\"Too Small\",IF(AND(VLOOKUP(LoB!O11,List!$A$2:$E$101,5,FALSE)<>\"\",LoB!Q11>=VLOOKUP(LoB!O11,List!$A$2:$E$101,5,FALSE)),\"Too Large\",\"OK\")))","v":""},null,{"$f":"IF(O11<>\"OK\",\"\",IF(AND(LoB!R11=\"Yes\",LoB!S11>LoB!T11),\"Min > Max\",IF(AND(LoB!R11=\"Yes\",NOT(ISNUMBER(LoB!S11))),\"Not Number\",\"OK\")))","v":""},{"$f":"IF(O11<>\"OK\",\"\",IF(AND(LoB!R11=\"Yes\",LoB!S11>LoB!T11),\"Min > Max\",IF(AND(LoB!R11=\"Yes\",NOT(ISNUMBER(LoB!T11))),\"Not Number\",\"OK\")))","v":""},{"$f":"IF($E11<>\"Yes\",\"\",IF(OR(LoB!U11=\"\",ISERROR(MATCH(LoB!U11,Index!$B$1:$CW$1,0))),\"Not Available\",\"OK\"))","v":""},{"$f":"IF($E11<>\"Yes\",\"\",IF(ISERROR(MATCH(LoB!V11,List!$A$2:$A$101,0)),\"Not Available\",\"OK\"))","v":""},{"$f":"IF(V11<>\"OK\",\"\",IF(LoB!V11=\"Empirical\",IF(OR(LoB!W11=\"\",ISERROR(MATCH(LoB!W11,Empirical!$B$1:$CW$1,0))),\"Not Available\",\"OK\"),IF(AND(VLOOKUP(LoB!V11,List!$A$2:$E$101,2,FALSE)<>\"\",LoB!W11<=VLOOKUP(LoB!V11,List!$A$2:$E$101,2,FALSE)),\"Too Small\",IF(AND(VLOOKUP(LoB!V11,List!$A$2:$E$101,3,FALSE)<>\"\",LoB!W11>=VLOOKUP(LoB!V11,List!$A$2:$E$101,3,FALSE)),\"Too Large\",\"OK\"))))","v":""},{"$f":"IF(V11<>\"OK\",\"\",IF(AND(VLOOKUP(LoB!V11,List!$A$2:$E$101,4,FALSE)<>\"\",LoB!X11<=VLOOKUP(LoB!V11,List!$A$2:$E$101,4,FALSE)),\"Too Small\",IF(AND(VLOOKUP(LoB!V11,List!$A$2:$E$101,5,FALSE)<>\"\",LoB!X11>=VLOOKUP(LoB!V11,List!$A$2:$E$101,5,FALSE)),\"Too Large\",\"OK\")))","v":""},null,{"$f":"IF(V11<>\"OK\",\"\",IF(AND(LoB!Y11=\"Yes\",LoB!Z11>LoB!AA11),\"Min > Max\",IF(AND(LoB!Y11=\"Yes\",NOT(ISNUMBER(LoB!Z11))),\"Not Number\",\"OK\")))","v":""},{"$f":"IF(V11<>\"OK\",\"\",IF(AND(LoB!Y11=\"Yes\",LoB!Z11>LoB!AA11),\"Min > Max\",IF(AND(LoB!Y11=\"Yes\",NOT(ISNUMBER(LoB!AA11))),\"Not Number\",\"OK\")))","v":""},{"$f":"IF($E11<>\"Yes\",\"\",IF(OR(LoB!AB11=\"\",ISERROR(MATCH(LoB!AB11,Index!$B$1:$CW$1,0))),\"Not Available\",\"OK\"))","v":""},{"$f":"IF($E11<>\"Yes\",\"\",IF(OR(LoB!AC11=\"CLOSED\",LoB!AC11=\"ALL\"),\"OK\",\"Not Available\"))","v":""},{"$f":"IF($E11<>\"Yes\",\"\",IF(ISERROR(MATCH(LoB!AD11,List!$A$2:$A$101,0)),\"Not Available\",\"OK\"))","v":""},{"$f":"IF(AD11<>\"OK\",\"\",IF(LoB!AD11=\"Empirical\",IF(OR(LoB!AE11=\"\",ISERROR(MATCH(LoB!AE11,Empirical!$B$1:$CW$1,0))),\"Not Available\",\"OK\"),IF(AND(VLOOKUP(LoB!AD11,List!$A$2:$E$101,2,FALSE)<>\"\",LoB!AE11<=VLOOKUP(LoB!AD11,List!$A$2:$E$101,2,FALSE)),\"Too Small\",IF(AND(VLOOKUP(LoB!AD11,List!$A$2:$E$101,3,FALSE)<>\"\",LoB!AE11>=VLOOKUP(LoB!AD11,List!$A$2:$E$101,3,FALSE)),\"Too Large\",\"OK\"))))","v":""},{"$f":"IF(AD11<>\"OK\",\"\",IF(AND(VLOOKUP(LoB!AD11,List!$A$2:$E$101,4,FALSE)<>\"\",LoB!AF11<=VLOOKUP(LoB!AD11,List!$A$2:$E$101,4,FALSE)),\"Too Small\",IF(AND(VLOOKUP(LoB!AD11,List!$A$2:$E$101,5,FALSE)<>\"\",LoB!AF11>=VLOOKUP(LoB!AD11,List!$A$2:$E$101,5,FALSE)),\"Too Large\",\"OK\")))","v":""},null,{"$f":"IF(AD11<>\"OK\",\"\",IF(AND(LoB!AG11=\"Yes\",LoB!AH11>LoB!AI11),\"Min > Max\",IF(AND(LoB!AG11=\"Yes\",NOT(ISNUMBER(LoB!AH11))),\"Not Number\",\"OK\")))","v":""},{"$f":"IF(AD11<>\"OK\",\"\",IF(AND(LoB!AG11=\"Yes\",LoB!AH11>LoB!AI11),\"Min > Max\",IF(AND(LoB!AG11=\"Yes\",NOT(ISNUMBER(LoB!AI11))),\"Not Number\",\"OK\")))","v":""},{"$f":"IF($E11<>\"Yes\",\"\",IF(ISERROR(MATCH(LoB!AJ11,List!$A$2:$A$101,0)),\"Not Available\",\"OK\"))","v":""},{"$f":"IF(AJ11<>\"OK\",\"\",IF(LoB!AJ11=\"Empirical\",IF(OR(LoB!AK11=\"\",ISERROR(MATCH(LoB!AK11,Empirical!$B$1:$CW$1,0))),\"Not Available\",\"OK\"),IF(AND(VLOOKUP(LoB!AJ11,List!$A$2:$E$101,2,FALSE)<>\"\",LoB!AK11<=VLOOKUP(LoB!AJ11,List!$A$2:$E$101,2,FALSE)),\"Too Small\",IF(AND(VLOOKUP(LoB!AJ11,List!$A$2:$E$101,3,FALSE)<>\"\",LoB!AK11>=VLOOKUP(LoB!AJ11,List!$A$2:$E$101,3,FALSE)),\"Too Large\",\"OK\"))))","v":""},{"$f":"IF(AJ11<>\"OK\",\"\",IF(AND(VLOOKUP(LoB!AJ11,List!$A$2:$E$101,4,FALSE)<>\"\",LoB!AL11<=VLOOKUP(LoB!AJ11,List!$A$2:$E$101,4,FALSE)),\"Too Small\",IF(AND(VLOOKUP(LoB!AJ11,List!$A$2:$E$101,5,FALSE)<>\"\",LoB!AL11>=VLOOKUP(LoB!AJ11,List!$A$2:$E$101,5,FALSE)),\"Too Large\",\"OK\")))","v":""},null,{"$f":"IF(AJ11<>\"OK\",\"\",IF(AND(LoB!AM11=\"Yes\",LoB!AN11>LoB!AO11),\"Min > Max\",IF(AND(LoB!AM11=\"Yes\",NOT(ISNUMBER(LoB!AN11))),\"Not Number\",\"OK\")))","v":""},{"$f":"IF(AJ11<>\"OK\",\"\",IF(AND(LoB!AM11=\"Yes\",LoB!AN11>LoB!AO11),\"Min > Max\",IF(AND(LoB!AM11=\"Yes\",NOT(ISNUMBER(LoB!AO11))),\"Not Number\",\"OK\")))","v":""},{"$f":"IF($E11<>\"Yes\",\"\",IF(ISERROR(MATCH(LoB!AP11,List!$A$2:$A$101,0)),\"Not Available\",\"OK\"))","v":""},{"$f":"IF(AP11<>\"OK\",\"\",IF(LoB!AP11=\"Empirical\",IF(OR(LoB!AQ11=\"\",ISERROR(MATCH(LoB!AQ11,Empirical!$B$1:$CW$1,0))),\"Not Available\",\"OK\"),IF(AND(VLOOKUP(LoB!AP11,List!$A$2:$E$101,2,FALSE)<>\"\",LoB!AQ11<=VLOOKUP(LoB!AP11,List!$A$2:$E$101,2,FALSE)),\"Too Small\",IF(AND(VLOOKUP(LoB!AP11,List!$A$2:$E$101,3,FALSE)<>\"\",LoB!AQ11>=VLOOKUP(LoB!AP11,List!$A$2:$E$101,3,FALSE)),\"Too Large\",\"OK\"))))","v":""},{"$f":"IF(AP11<>\"OK\",\"\",IF(AND(VLOOKUP(LoB!AP11,List!$A$2:$E$101,4,FALSE)<>\"\",LoB!AR11<=VLOOKUP(LoB!AP11,List!$A$2:$E$101,4,FALSE)),\"Too Small\",IF(AND(VLOOKUP(LoB!AP11,List!$A$2:$E$101,5,FALSE)<>\"\",LoB!AR11>=VLOOKUP(LoB!AP11,List!$A$2:$E$101,5,FALSE)),\"Too Large\",\"OK\")))","v":""},null,{"$f":"IF(AP11<>\"OK\",\"\",IF(AND(LoB!AS11=\"Yes\",LoB!AT11>LoB!AU11),\"Min > Max\",IF(AND(LoB!AS11=\"Yes\",NOT(ISNUMBER(LoB!AT11))),\"Not Number\",\"OK\")))","v":""},{"$f":"IF(AP11<>\"OK\",\"\",IF(AND(LoB!AS11=\"Yes\",LoB!AT11>LoB!AU11),\"Min > Max\",IF(AND(LoB!AS11=\"Yes\",NOT(ISNUMBER(LoB!AU11))),\"Not Number\",\"OK\")))","v":""},{"$f":"IF($E11<>\"Yes\",\"\",IF(ISERROR(MATCH(LoB!AV11,List!$F$2:$F$101,0)),\"Not Available\",\"OK\"))","v":""},{"$f":"IF(AV11<>\"OK\",\"\",IF(LoB!AV11=\"Independent\",\"OK\",IF(OR(AND(LoB!AV11=\"clayton\",LoB!AW11<-1),AND(OR(LoB!AV11=\"gumbel\",LoB!AV11=\"joe\"),LoB!AW11<1),AND(LoB!AV11<>\"normal\",LoB!AV11<>\"t\",LoB!AW11=0)),\"Invalid Value\",IF(AND(OR(LoB!AV11=\"normal\",LoB!AV11=\"t\"),ABS(LoB!AW11)>1),\"|Correlation|>1\",IF(AND(OR(LoB!AV11=\"normal\",LoB!AV11=\"t\"),LoB!AW11=\"\"),\"No Value\",\"OK\")))))","v":""},{"$f":"IF(AV11<>\"OK\",\"\",IF(LoB!AV11=\"Independent\",\"OK\", IF(AND(OR(LoB!AV11=\"normal\",LoB!AV11=\"t\"),1-LoB!AW11*LoB!AX11<0),\"Non Positive Semidefinite\",IF(ABS(LoB!AX11)>1,\"|Correlation|>1\",IF(LoB!AX11=\"\",\"No Value\",\"OK\")))))","v":""},{"$f":"IF(AV11<>\"OK\",\"\",IF(AND(OR(LoB!AV11=\"normal\",LoB!AV11=\"t\"),detm(LoB!AW11,LoB!AX11,LoB!AY11)<0),\"Non Positive Semidefinite\",IF(ABS(LoB!AY11)>1,\"|Correlation >1\",IF(LoB!AY11=\"\",\"\",\"OK\"))))","v":""},{"$f":"IF(AV11<>\"OK\",\"\",IF(AND(LoB!AV11=\"t\",LoB!AZ11<=0),\"Wrong DoF\",\"OK\"))","v":""},{"$f":"IF($E11<>\"Yes\",\"\",IF(OR(LoB!BA11=\"\",AND(ISERROR(MATCH(LoB!BA11,FactorTable!$B$1:$GS$1,0)),ISERROR(MATCH(LoB!BA11,Function!$C$1:$CX$1,0)))),\"Not Available\",\"OK\"))","v":""},{"$f":"IF($E11<>\"Yes\",\"\",IF(OR(LoB!BB11=\"Empirical\",LoB!BB11=\"None\",LoB!BB11=\"Fixed\"),\"OK\",\"Wrong\"))","v":""},{"$f":"IF(BB11<>\"OK\",\"\",IF(LoB!BB11=\"Empirical\",IF(OR(LoB!BC11=\"\",ISERROR(MATCH(LoB!BC11,Empirical!$B$1:$CW$1,0))),\"Not Available\",\"OK\"),IF(AND(LoB!BB11=\"Fixed\",LoB!BC11>=0),\"OK\",\"OK\")))","v":""},{"$f":"IF($E11<>\"Yes\",\"\",IF(OR(LoB!BD11=\"Empirical\",LoB!BD11=\"None\",LoB!BB11=\"Fixed\"),\"OK\",\"Wrong\"))","v":""},{"$f":"IF(BD11<>\"OK\",\"\",IF(LoB!BD11=\"Empirical\",IF(OR(LoB!BE11=\"\",ISERROR(MATCH(LoB!BE11,Empirical!$B$1:$CW$1,0))),\"Not Available\",\"OK\"),IF(AND(LoB!BD11=\"Fixed\",LoB!BE11>=0),\"OK\",\"OK\")))","v":""},{"$f":"IF($E11<>\"Yes\",\"\",IF(OR(LoB!BF11=\"\",ISERROR(MATCH(LoB!BF11,List!$M$2:$M$28,0))),\"Not Available\",\"OK\"))","v":""}]
[null,"Correct",{"$f":"IF(LoB!C12=\"\",\"\",LoB!C12)","v":""},{"$f":"IF(LoB!D12=\"\",\"\",LoB!D12)","v":""},{"$f":"IF(LoB!E12=\"\",\"\",LoB!E12)","v":""},{"$f":"IF($E12<>\"Yes\",\"\",IF(OR(LoB!F12=\"CondPaid\",LoB!F12=\"CondIncurLoss\"),\"OK\",IF(OR(AND(ISERROR(MATCH(LoB!F12,FactorTable!$B$1:$GS$1,0)),ISERROR(MATCH(LoB!F12,Function!$C$1:$CX$1,0)))),\"Not Available\",\"OK\")))","v":""},{"$f":"IF($E12<>\"Yes\",\"\",IF(OR(LoB!G12=\"\",AND(ISERROR(MATCH(LoB!G12,FactorTable!$B$1:$GS$1,0)),ISERROR(MATCH(LoB!G12,Function!$C$1:$CX$1,0)))),\"Not Available\",\"OK\"))","v":""},{"$f":"IF($E12<>\"Yes\",\"\",IF(OR(LoB!H12=\"CondPaid\",LoB!H12=\"CondIncurLoss\"),\"OK\",IF(OR(AND(ISERROR(MATCH(LoB!H12,FactorTable!$B$1:$GS$1,0)),ISERROR(MATCH(LoB!H12,Function!$C$1:$CX$1,0)))),\"Not Available\",\"OK\")))","v":""},{"$f":"IF($E12<>\"Yes\",\"\",IF(ISERROR(MATCH(LoB!I12,List!$A$2:$A$101,0)),\"Not Available\",\"OK\"))","v":""},{"$f":"IF(I12<>\"OK\",\"\",IF(LoB!I12=\"Empirical\",IF(OR(LoB!J12=\"\",ISERROR(MATCH(LoB!J12,Empirical!$B$1:$CW$1,0))),\"Not Available\",\"OK\"),IF(AND(VLOOKUP(LoB!I12,List!$A$2:$E$101,2,FALSE)<>\"\",LoB!J12<=VLOOKUP(LoB!I12,List!$A$2:$E$101,2,FALSE)),\"Too Small\",IF(AND(VLOOKUP(LoB!I12,List!$A$2:$E$101,3,FALSE)<>\"\",LoB!J12>=VLOOKUP(LoB!I12,List!$A$2:$E$101,3,FALSE)),\"Too Large\",\"OK\"))))","v":""},{"$f":"IF(I12<>\"OK\",\"\",IF(AND(VLOOKUP(LoB!I12,List!$A$2:$E$101,4,FALSE)<>\"\",LoB!K12<=VLOOKUP(LoB!I12,List!$A$2:$E$101,4,FALSE)),\"Too Small\",IF(AND(VLOOKUP(LoB!I12,List!$A$2:$E$101,5,FALSE)<>\"\",LoB!K12>=VLOOKUP(LoB!I12,List!$A$2:$E$101,5,FALSE)),\"Too Large\",\"OK\")))","v":""},null,{"$f":"IF(I12<>\"OK\",\"\",IF(AND(LoB!L12=\"Yes\",LoB!M12>LoB!N12),\"Min > Max\",IF(AND(LoB!L12=\"Yes\",NOT(ISNUMBER(LoB!M12))),\"Not Number\",\"OK\")))","v":""},{"$f":"IF(I12<>\"OK\",\"\",IF(AND(LoB!L12=\"Yes\",LoB!M12>LoB!N12),\"Min > Max\",IF(AND(LoB!L12=\"Yes\",NOT(ISNUMBER(LoB!N12))),\"Not Number\",\"OK\")))","v":""},{"$f":"IF($E12<>\"Yes\",\"\",IF(ISERROR(MATCH(LoB!O12,List!$A$2:$A$101,0)),\"Not Available\",\"OK\"))","v":""},{"$f":"IF(O12<>\"OK\",\"\",IF(LoB!O12=\"Empirical\",IF(OR(LoB!P12=\"\",ISERROR(MATCH(LoB!P12,Empirical!$B$1:$CW$1,0))),\"Not Available\",\"OK\"),IF(AND(VLOOKUP(LoB!O12,List!$A$2:$E$101,2,FALSE)<>\"\",LoB!P12<=VLOOKUP(LoB!O12,List!$A$2:$E$101,2,FALSE)),\"Too Small\",IF(AND(VLOOKUP(LoB!O12,List!$A$2:$E$101,3,FALSE)<>\"\",LoB!P12>=VLOOKUP(LoB!O12,List!$A$2:$E$101,3,FALSE)),\"Too Large\",\"OK\"))))","v":""},{"$f":"IF(O12<>\"OK\",\"\",IF(AND(VLOOKUP(LoB!O12,List!$A$2:$E$101,4,FALSE)<>\"\",LoB!Q12<=VLOOKUP(LoB!O12,List!$A$2:$E$101,4,FALSE)),\"Too Small\",IF(AND(VLOOKUP(LoB!O12,List!$A$2:$E$101,5,FALSE)<>\"\",LoB!Q12>=VLOOKUP(LoB!O12,List!$A$2:$E$101,5,FALSE)),\"Too Large\",\"OK\")))","v":""},null,{"$f":"IF(O12<>\"OK\",\"\",IF(AND(LoB!R12=\"Yes\",LoB!S12>LoB!T12),\"Min > Max\",IF(AND(LoB!R12=\"Yes\",NOT(ISNUMBER(LoB!S12))),\"Not Number\",\"OK\")))","v":""},{"$f":"IF(O12<>\"OK\",\"\",IF(AND(LoB!R12=\"Yes\",LoB!S12>LoB!T12),\"Min > Max\",IF(AND(LoB!R12=\"Yes\",NOT(ISNUMBER(LoB!T12))),\"Not Number\",\"OK\")))","v":""},{"$f":"IF($E12<>\"Yes\",\"\",IF(OR(LoB!U12=\"\",ISERROR(MATCH(LoB!U12,Index!$B$1:$CW$1,0))),\"Not Available\",\"OK\"))","v":""},{"$f":"IF($E12<>\"Yes\",\"\",IF(ISERROR(MATCH(LoB!V12,List!$A$2:$A$101,0)),\"Not Available\",\"OK\"))","v":""},{"$f":"IF(V12<>\"OK\",\"\",IF(LoB!V12=\"Empirical\",IF(OR(LoB!W12=\"\",ISERROR(MATCH(LoB!W12,Empirical!$B$1:$CW$1,0))),\"Not Available\",\"OK\"),IF(AND(VLOOKUP(LoB!V12,List!$A$2:$E$101,2,FALSE)<>\"\",LoB!W12<=VLOOKUP(LoB!V12,List!$A$2:$E$101,2,FALSE)),\"Too Small\",IF(AND(VLOOKUP(LoB!V12,List!$A$2:$E$101,3,FALSE)<>\"\",LoB!W12>=VLOOKUP(LoB!V12,List!$A$2:$E$101,3,FALSE)),\"Too Large\",\"OK\"))))","v":""},{"$f":"IF(V12<>\"OK\",\"\",IF(AND(VLOOKUP(LoB!V12,List!$A$2:$E$101,4,FALSE)<>\"\",LoB!X12<=VLOOKUP(LoB!V12,List!$A$2:$E$101,4,FALSE)),\"Too Small\",IF(AND(VLOOKUP(LoB!V12,List!$A$2:$E$101,5,FALSE)<>\"\",LoB!X12>=VLOOKUP(LoB!V12,List!$A$2:$E$101,5,FALSE)),\"Too Large\",\"OK\")))","v":""},null,{"$f":"IF(V12<>\"OK\",\"\",IF(AND(LoB!Y12=\"Yes\",LoB!Z12>LoB!AA12),\"Min > Max\",IF(AND(LoB!Y12=\"Yes\",NOT(ISNUMBER(LoB!Z12))),\"Not Number\",\"OK\")))","v":""},{"$f":"IF(V12<>\"OK\",\"\",IF(AND(LoB!Y12=\"Yes\",LoB!Z12>LoB!AA12),\"Min > Max\",IF(AND(LoB!Y12=\"Yes\",NOT(ISNUMBER(LoB!AA12))),\"Not Number\",\"OK\")))","v":""},{"$f":"IF($E12<>\"Yes\",\"\",IF(OR(LoB!AB12=\"\",ISERROR(MATCH(LoB!AB12,Index!$B$1:$CW$1,0))),\"Not Available\",\"OK\"))","v":""},{"$f":"IF($E12<>\"Yes\",\"\",IF(OR(LoB!AC12=\"CLOSED\",LoB!AC12=\"ALL\"),\"OK\",\"Not Available\"))","v":""},{"$f":"IF($E12<>\"Yes\",\"\",IF(ISERROR(MATCH(LoB!AD12,List!$A$2:$A$101,0)),\"Not Available\",\"OK\"))","v":""},{"$f":"IF(AD12<>\"OK\",\"\",IF(LoB!AD12=\"Empirical\",IF(OR(LoB!AE12=\"\",ISERROR(MATCH(LoB!AE12,Empirical!$B$1:$CW$1,0))),\"Not Available\",\"OK\"),IF(AND(VLOOKUP(LoB!AD12,List!$A$2:$E$101,2,FALSE)<>\"\",LoB!AE12<=VLOOKUP(LoB!AD12,List!$A$2:$E$101,2,FALSE)),\"Too Small\",IF(AND(VLOOKUP(LoB!AD12,List!$A$2:$E$101,3,FALSE)<>\"\",LoB!AE12>=VLOOKUP(LoB!AD12,List!$A$2:$E$101,3,FALSE)),\"Too Large\",\"OK\"))))","v":""},{"$f":"IF(AD12<>\"OK\",\"\",IF(AND(VLOOKUP(LoB!AD12,List!$A$2:$E$101,4,FALSE)<>\"\",LoB!AF12<=VLOOKUP(LoB!AD12,List!$A$2:$E$101,4,FALSE)),\"Too Small\",IF(AND(VLOOKUP(LoB!AD12,List!$A$2:$E$101,5,FALSE)<>\"\",LoB!AF12>=VLOOKUP(LoB!AD12,List!$A$2:$E$101,5,FALSE)),\"Too Large\",\"OK\")))","v":""},null,{"$f":"IF(AD12<>\"OK\",\"\",IF(AND(LoB!AG12=\"Yes\",LoB!AH12>LoB!AI12),\"Min > Max\",IF(AND(LoB!AG12=\"Yes\",NOT(ISNUMBER(LoB!AH12))),\"Not Number\",\"OK\")))","v":""},{"$f":"IF(AD12<>\"OK\",\"\",IF(AND(LoB!AG12=\"Yes\",LoB!AH12>LoB!AI12),\"Min > Max\",IF(AND(LoB!AG12=\"Yes\",NOT(ISNUMBER(LoB!AI12))),\"Not Number\",\"OK\")))","v":""},{"$f":"IF($E12<>\"Yes\",\"\",IF(ISERROR(MATCH(LoB!AJ12,List!$A$2:$A$101,0)),\"Not Available\",\"OK\"))","v":""},{"$f":"IF(AJ12<>\"OK\",\"\",IF(LoB!AJ12=\"Empirical\",IF(OR(LoB!AK12=\"\",ISERROR(MATCH(LoB!AK12,Empirical!$B$1:$CW$1,0))),\"Not Available\",\"OK\"),IF(AND(VLOOKUP(LoB!AJ12,List!$A$2:$E$101,2,FALSE)<>\"\",LoB!AK12<=VLOOKUP(LoB!AJ12,List!$A$2:$E$101,2,FALSE)),\"Too Small\",IF(AND(VLOOKUP(LoB!AJ12,List!$A$2:$E$101,3,FALSE)<>\"\",LoB!AK12>=VLOOKUP(LoB!AJ12,List!$A$2:$E$101,3,FALSE)),\"Too Large\",\"OK\"))))","v":""},{"$f":"IF(AJ12<>\"OK\",\"\",IF(AND(VLOOKUP(LoB!AJ12,List!$A$2:$E$101,4,FALSE)<>\"\",LoB!AL12<=VLOOKUP(LoB!AJ12,List!$A$2:$E$101,4,FALSE)),\"Too Small\",IF(AND(VLOOKUP(LoB!AJ12,List!$A$2:$E$101,5,FALSE)<>\"\",LoB!AL12>=VLOOKUP(LoB!AJ12,List!$A$2:$E$101,5,FALSE)),\"Too Large\",\"OK\")))","v":""},null,{"$f":"IF(AJ12<>\"OK\",\"\",IF(AND(LoB!AM12=\"Yes\",LoB!AN12>LoB!AO12),\"Min > Max\",IF(AND(LoB!AM12=\"Yes\",NOT(ISNUMBER(LoB!AN12))),\"Not Number\",\"OK\")))","v":""},{"$f":"IF(AJ12<>\"OK\",\"\",IF(AND(LoB!AM12=\"Yes\",LoB!AN12>LoB!AO12),\"Min > Max\",IF(AND(LoB!AM12=\"Yes\",NOT(ISNUMBER(LoB!AO12))),\"Not Number\",\"OK\")))","v":""},{"$f":"IF($E12<>\"Yes\",\"\",IF(ISERROR(MATCH(LoB!AP12,List!$A$2:$A$101,0)),\"Not Available\",\"OK\"))","v":""},{"$f":"IF(AP12<>\"OK\",\"\",IF(LoB!AP12=\"Empirical\",IF(OR(LoB!AQ12=\"\",ISERROR(MATCH(LoB!AQ12,Empirical!$B$1:$CW$1,0))),\"Not Available\",\"OK\"),IF(AND(VLOOKUP(LoB!AP12,List!$A$2:$E$101,2,FALSE)<>\"\",LoB!AQ12<=VLOOKUP(LoB!AP12,List!$A$2:$E$101,2,FALSE)),\"Too Small\",IF(AND(VLOOKUP(LoB!AP12,List!$A$2:$E$101,3,FALSE)<>\"\",LoB!AQ12>=VLOOKUP(LoB!AP12,List!$A$2:$E$101,3,FALSE)),\"Too Large\",\"OK\"))))","v":""},{"$f":"IF(AP12<>\"OK\",\"\",IF(AND(VLOOKUP(LoB!AP12,List!$A$2:$E$101,4,FALSE)<>\"\",LoB!AR12<=VLOOKUP(LoB!AP12,List!$A$2:$E$101,4,FALSE)),\"Too Small\",IF(AND(VLOOKUP(LoB!AP12,List!$A$2:$E$101,5,FALSE)<>\"\",LoB!AR12>=VLOOKUP(LoB!AP12,List!$A$2:$E$101,5,FALSE)),\"Too Large\",\"OK\")))","v":""},null,{"$f":"IF(AP12<>\"OK\",\"\",IF(AND(LoB!AS12=\"Yes\",LoB!AT12>LoB!AU12),\"Min > Max\",IF(AND(LoB!AS12=\"Yes\",NOT(ISNUMBER(LoB!AT12))),\"Not Number\",\"OK\")))","v":""},{"$f":"IF(AP12<>\"OK\",\"\",IF(AND(LoB!AS12=\"Yes\",LoB!AT12>LoB!AU12),\"Min > Max\",IF(AND(LoB!AS12=\"Yes\",NOT(ISNUMBER(LoB!AU12))),\"Not Number\",\"OK\")))","v":""},{"$f":"IF($E12<>\"Yes\",\"\",IF(ISERROR(MATCH(LoB!AV12,List!$F$2:$F$101,0)),\"Not Available\",\"OK\"))","v":""},{"$f":"IF(AV12<>\"OK\",\"\",IF(LoB!AV12=\"Independent\",\"OK\",IF(OR(AND(LoB!AV12=\"clayton\",LoB!AW12<-1),AND(OR(LoB!AV12=\"gumbel\",LoB!AV12=\"joe\"),LoB!AW12<1),AND(LoB!AV12<>\"normal\",LoB!AV12<>\"t\",LoB!AW12=0)),\"Invalid Value\",IF(AND(OR(LoB!AV12=\"normal\",LoB!AV12=\"t\"),ABS(LoB!AW12)>1),\"|Correlation|>1\",IF(AND(OR(LoB!AV12=\"normal\",LoB!AV12=\"t\"),LoB!AW12=\"\"),\"No Value\",\"OK\")))))","v":""},{"$f":"IF(AV12<>\"OK\",\"\",IF(LoB!AV12=\"Independent\",\"OK\", IF(AND(OR(LoB!AV12=\"normal\",LoB!AV12=\"t\"),1-LoB!AW12*LoB!AX12<0),\"Non Positive Semidefinite\",IF(ABS(LoB!AX12)>1,\"|Correlation|>1\",IF(LoB!AX12=\"\",\"No Value\",\"OK\")))))","v":""},{"$f":"IF(AV12<>\"OK\",\"\",IF(AND(OR(LoB!AV12=\"normal\",LoB!AV12=\"t\"),detm(LoB!AW12,LoB!AX12,LoB!AY12)<0),\"Non Positive Semidefinite\",IF(ABS(LoB!AY12)>1,\"|Correlation >1\",IF(LoB!AY12=\"\",\"\",\"OK\"))))","v":""},{"$f":"IF(AV12<>\"OK\",\"\",IF(AND(LoB!AV12=\"t\",LoB!AZ12<=0),\"Wrong DoF\",\"OK\"))","v":""},{"$f":"IF($E12<>\"Yes\",\"\",IF(OR(LoB!BA12=\"\",AND(ISERROR(MATCH(LoB!BA12,FactorTable!$B$1:$GS$1,0)),ISERROR(MATCH(LoB!BA12,Function!$C$1:$CX$1,0)))),\"Not Available\",\"OK\"))","v":""},{"$f":"IF($E12<>\"Yes\",\"\",IF(OR(LoB!BB12=\"Empirical\",LoB!BB12=\"None\",LoB!BB12=\"Fixed\"),\"OK\",\"Wrong\"))","v":""},{"$f":"IF(BB12<>\"OK\",\"\",IF(LoB!BB12=\"Empirical\",IF(OR(LoB!BC12=\"\",ISERROR(MATCH(LoB!BC12,Empirical!$B$1:$CW$1,0))),\"Not Available\",\"OK\"),IF(AND(LoB!BB12=\"Fixed\",LoB!BC12>=0),\"OK\",\"OK\")))","v":""},{"$f":"IF($E12<>\"Yes\",\"\",IF(OR(LoB!BD12=\"Empirical\",LoB!BD12=\"None\",LoB!BB12=\"Fixed\"),\"OK\",\"Wrong\"))","v":""},{"$f":"IF(BD12<>\"OK\",\"\",IF(LoB!BD12=\"Empirical\",IF(OR(LoB!BE12=\"\",ISERROR(MATCH(LoB!BE12,Empirical!$B$1:$CW$1,0))),\"Not Available\",\"OK\"),IF(AND(LoB!BD12=\"Fixed\",LoB!BE12>=0),\"OK\",\"OK\")))","v":""},{"$f":"IF($E12<>\"Yes\",\"\",IF(OR(LoB!BF12=\"\",ISERROR(MATCH(LoB!BF12,List!$M$2:$M$28,0))),\"Not Available\",\"OK\"))","v":""}]
[null,"Correct",{"$f":"IF(LoB!C13=\"\",\"\",LoB!C13)","v":""},{"$f":"IF(LoB!D13=\"\",\"\",LoB!D13)","v":""},{"$f":"IF(LoB!E13=\"\",\"\",LoB!E13)","v":""},{"$f":"IF($E13<>\"Yes\",\"\",IF(OR(LoB!F13=\"CondPaid\",LoB!F13=\"CondIncurLoss\"),\"OK\",IF(OR(AND(ISERROR(MATCH(LoB!F13,FactorTable!$B$1:$GS$1,0)),ISERROR(MATCH(LoB!F13,Function!$C$1:$CX$1,0)))),\"Not Available\",\"OK\")))","v":""},{"$f":"IF($E13<>\"Yes\",\"\",IF(OR(LoB!G13=\"\",AND(ISERROR(MATCH(LoB!G13,FactorTable!$B$1:$GS$1,0)),ISERROR(MATCH(LoB!G13,Function!$C$1:$CX$1,0)))),\"Not Available\",\"OK\"))","v":""},{"$f":"IF($E13<>\"Yes\",\"\",IF(OR(LoB!H13=\"CondPaid\",LoB!H13=\"CondIncurLoss\"),\"OK\",IF(OR(AND(ISERROR(MATCH(LoB!H13,FactorTable!$B$1:$GS$1,0)),ISERROR(MATCH(LoB!H13,Function!$C$1:$CX$1,0)))),\"Not Available\",\"OK\")))","v":""},{"$f":"IF($E13<>\"Yes\",\"\",IF(ISERROR(MATCH(LoB!I13,List!$A$2:$A$101,0)),\"Not Available\",\"OK\"))","v":""},{"$f":"IF(I13<>\"OK\",\"\",IF(LoB!I13=\"Empirical\",IF(OR(LoB!J13=\"\",ISERROR(MATCH(LoB!J13,Empirical!$B$1:$CW$1,0))),\"Not Available\",\"OK\"),IF(AND(VLOOKUP(LoB!I13,List!$A$2:$E$101,2,FALSE)<>\"\",LoB!J13<=VLOOKUP(LoB!I13,List!$A$2:$E$101,2,FALSE)),\"Too Small\",IF(AND(VLOOKUP(LoB!I13,List!$A$2:$E$101,3,FALSE)<>\"\",LoB!J13>=VLOOKUP(LoB!I13,List!$A$2:$E$101,3,FALSE)),\"Too Large\",\"OK\"))))","v":""},{"$f":"IF(I13<>\"OK\",\"\",IF(AND(VLOOKUP(LoB!I13,List!$A$2:$E$101,4,FALSE)<>\"\",LoB!K13<=VLOOKUP(LoB!I13,List!$A$2:$E$101,4,FALSE)),\"Too Small\",IF(AND(VLOOKUP(LoB!I13,List!$A$2:$E$101,5,FALSE)<>\"\",LoB!K13>=VLOOKUP(LoB!I13,List!$A$2:$E$101,5,FALSE)),\"Too Large\",\"OK\")))","v":""},null,{"$f":"IF(I13<>\"OK\",\"\",IF(AND(LoB!L13=\"Yes\",LoB!M13>LoB!N13),\"Min > Max\",IF(AND(LoB!L13=\"Yes\",NOT(ISNUMBER(LoB!M13))),\"Not Number\",\"OK\")))","v":""},{"$f":"IF(I13<>\"OK\",\"\",IF(AND(LoB!L13=\"Yes\",LoB!M13>LoB!N13),\"Min > Max\",IF(AND(LoB!L13=\"Yes\",NOT(ISNUMBER(LoB!N13))),\"Not Number\",\"OK\")))","v":""},{"$f":"IF($E13<>\"Yes\",\"\",IF(ISERROR(MATCH(LoB!O13,List!$A$2:$A$101,0)),\"Not Available\",\"OK\"))","v":""},{"$f":"IF(O13<>\"OK\",\"\",IF(LoB!O13=\"Empirical\",IF(OR(LoB!P13=\"\",ISERROR(MATCH(LoB!P13,Empirical!$B$1:$CW$1,0))),\"Not Available\",\"OK\"),IF(AND(VLOOKUP(LoB!O13,List!$A$2:$E$101,2,FALSE)<>\"\",LoB!P13<=VLOOKUP(LoB!O13,List!$A$2:$E$101,2,FALSE)),\"Too Small\",IF(AND(VLOOKUP(LoB!O13,List!$A$2:$E$101,3,FALSE)<>\"\",LoB!P13>=VLOOKUP(LoB!O13,List!$A$2:$E$101,3,FALSE)),\"Too Large\",\"OK\"))))","v":""},{"$f":"IF(O13<>\"OK\",\"\",IF(AND(VLOOKUP(LoB!O13,List!$A$2:$E$101,4,FALSE)<>\"\",LoB!Q13<=VLOOKUP(LoB!O13,List!$A$2:$E$101,4,FALSE)),\"Too Small\",IF(AND(VLOOKUP(LoB!O13,List!$A$2:$E$101,5,FALSE)<>\"\",LoB!Q13>=VLOOKUP(LoB!O13,List!$A$2:$E$101,5,FALSE)),\"Too Large\",\"OK\")))","v":""},null,{"$f":"IF(O13<>\"OK\",\"\",IF(AND(LoB!R13=\"Yes\",LoB!S13>LoB!T13),\"Min > Max\",IF(AND(LoB!R13=\"Yes\",NOT(ISNUMBER(LoB!S13))),\"Not Number\",\"OK\")))","v":""},{"$f":"IF(O13<>\"OK\",\"\",IF(AND(LoB!R13=\"Yes\",LoB!S13>LoB!T13),\"Min > Max\",IF(AND(LoB!R13=\"Yes\",NOT(ISNUMBER(LoB!T13))),\"Not Number\",\"OK\")))","v":""},{"$f":"IF($E13<>\"Yes\",\"\",IF(OR(LoB!U13=\"\",ISERROR(MATCH(LoB!U13,Index!$B$1:$CW$1,0))),\"Not Available\",\"OK\"))","v":""},{"$f":"IF($E13<>\"Yes\",\"\",IF(ISERROR(MATCH(LoB!V13,List!$A$2:$A$101,0)),\"Not Available\",\"OK\"))","v":""},{"$f":"IF(V13<>\"OK\",\"\",IF(LoB!V13=\"Empirical\",IF(OR(LoB!W13=\"\",ISERROR(MATCH(LoB!W13,Empirical!$B$1:$CW$1,0))),\"Not Available\",\"OK\"),IF(AND(VLOOKUP(LoB!V13,List!$A$2:$E$101,2,FALSE)<>\"\",LoB!W13<=VLOOKUP(LoB!V13,List!$A$2:$E$101,2,FALSE)),\"Too Small\",IF(AND(VLOOKUP(LoB!V13,List!$A$2:$E$101,3,FALSE)<>\"\",LoB!W13>=VLOOKUP(LoB!V13,List!$A$2:$E$101,3,FALSE)),\"Too Large\",\"OK\"))))","v":""},{"$f":"IF(V13<>\"OK\",\"\",IF(AND(VLOOKUP(LoB!V13,List!$A$2:$E$101,4,FALSE)<>\"\",LoB!X13<=VLOOKUP(LoB!V13,List!$A$2:$E$101,4,FALSE)),\"Too Small\",IF(AND(VLOOKUP(LoB!V13,List!$A$2:$E$101,5,FALSE)<>\"\",LoB!X13>=VLOOKUP(LoB!V13,List!$A$2:$E$101,5,FALSE)),\"Too Large\",\"OK\")))","v":""},null,{"$f":"IF(V13<>\"OK\",\"\",IF(AND(LoB!Y13=\"Yes\",LoB!Z13>LoB!AA13),\"Min > Max\",IF(AND(LoB!Y13=\"Yes\",NOT(ISNUMBER(LoB!Z13))),\"Not Number\",\"OK\")))","v":""},{"$f":"IF(V13<>\"OK\",\"\",IF(AND(LoB!Y13=\"Yes\",LoB!Z13>LoB!AA13),\"Min > Max\",IF(AND(LoB!Y13=\"Yes\",NOT(ISNUMBER(LoB!AA13))),\"Not Number\",\"OK\")))","v":""},{"$f":"IF($E13<>\"Yes\",\"\",IF(OR(LoB!AB13=\"\",ISERROR(MATCH(LoB!AB13,Index!$B$1:$CW$1,0))),\"Not Available\",\"OK\"))","v":""},{"$f":"IF($E13<>\"Yes\",\"\",IF(OR(LoB!AC13=\"CLOSED\",LoB!AC13=\"ALL\"),\"OK\",\"Not Available\"))","v":""},{"$f":"IF($E13<>\"Yes\",\"\",IF(ISERROR(MATCH(LoB!AD13,List!$A$2:$A$101,0)),\"Not Available\",\"OK\"))","v":""},{"$f":"IF(AD13<>\"OK\",\"\",IF(LoB!AD13=\"Empirical\",IF(OR(LoB!AE13=\"\",ISERROR(MATCH(LoB!AE13,Empirical!$B$1:$CW$1,0))),\"Not Available\",\"OK\"),IF(AND(VLOOKUP(LoB!AD13,List!$A$2:$E$101,2,FALSE)<>\"\",LoB!AE13<=VLOOKUP(LoB!AD13,List!$A$2:$E$101,2,FALSE)),\"Too Small\",IF(AND(VLOOKUP(LoB!AD13,List!$A$2:$E$101,3,FALSE)<>\"\",LoB!AE13>=VLOOKUP(LoB!AD13,List!$A$2:$E$101,3,FALSE)),\"Too Large\",\"OK\"))))","v":""},{"$f":"IF(AD13<>\"OK\",\"\",IF(AND(VLOOKUP(LoB!AD13,List!$A$2:$E$101,4,FALSE)<>\"\",LoB!AF13<=VLOOKUP(LoB!AD13,List!$A$2:$E$101,4,FALSE)),\"Too Small\",IF(AND(VLOOKUP(LoB!AD13,List!$A$2:$E$101,5,FALSE)<>\"\",LoB!AF13>=VLOOKUP(LoB!AD13,List!$A$2:$E$101,5,FALSE)),\"Too Large\",\"OK\")))","v":""},null,{"$f":"IF(AD13<>\"OK\",\"\",IF(AND(LoB!AG13=\"Yes\",LoB!AH13>LoB!AI13),\"Min > Max\",IF(AND(LoB!AG13=\"Yes\",NOT(ISNUMBER(LoB!AH13))),\"Not Number\",\"OK\")))","v":""},{"$f":"IF(AD13<>\"OK\",\"\",IF(AND(LoB!AG13=\"Yes\",LoB!AH13>LoB!AI13),\"Min > Max\",IF(AND(LoB!AG13=\"Yes\",NOT(ISNUMBER(LoB!AI13))),\"Not Number\",\"OK\")))","v":""},{"$f":"IF($E13<>\"Yes\",\"\",IF(ISERROR(MATCH(LoB!AJ13,List!$A$2:$A$101,0)),\"Not Available\",\"OK\"))","v":""},{"$f":"IF(AJ13<>\"OK\",\"\",IF(LoB!AJ13=\"Empirical\",IF(OR(LoB!AK13=\"\",ISERROR(MATCH(LoB!AK13,Empirical!$B$1:$CW$1,0))),\"Not Available\",\"OK\"),IF(AND(VLOOKUP(LoB!AJ13,List!$A$2:$E$101,2,FALSE)<>\"\",LoB!AK13<=VLOOKUP(LoB!AJ13,List!$A$2:$E$101,2,FALSE)),\"Too Small\",IF(AND(VLOOKUP(LoB!AJ13,List!$A$2:$E$101,3,FALSE)<>\"\",LoB!AK13>=VLOOKUP(LoB!AJ13,List!$A$2:$E$101,3,FALSE)),\"Too Large\",\"OK\"))))","v":""},{"$f":"IF(AJ13<>\"OK\",\"\",IF(AND(VLOOKUP(LoB!AJ13,List!$A$2:$E$101,4,FALSE)<>\"\",LoB!AL13<=VLOOKUP(LoB!AJ13,List!$A$2:$E$101,4,FALSE)),\"Too Small\",IF(AND(VLOOKUP(LoB!AJ13,List!$A$2:$E$101,5,FALSE)<>\"\",LoB!AL13>=VLOOKUP(LoB!AJ13,List!$A$2:$E$101,5,FALSE)),\"Too Large\",\"OK\")))","v":""},null,{"$f":"IF(AJ13<>\"OK\",\"\",IF(AND(LoB!AM13=\"Yes\",LoB!AN13>LoB!AO13),\"Min > Max\",IF(AND(LoB!AM13=\"Yes\",NOT(ISNUMBER(LoB!AN13))),\"Not Number\",\"OK\")))","v":""},{"$f":"IF(AJ13<>\"OK\",\"\",IF(AND(LoB!AM13=\"Yes\",LoB!AN13>LoB!AO13),\"Min > Max\",IF(AND(LoB!AM13=\"Yes\",NOT(ISNUMBER(LoB!AO13))),\"Not Number\",\"OK\")))","v":""},{"$f":"IF($E13<>\"Yes\",\"\",IF(ISERROR(MATCH(LoB!AP13,List!$A$2:$A$101,0)),\"Not Available\",\"OK\"))","v":""},{"$f":"IF(AP13<>\"OK\",\"\",IF(LoB!AP13=\"Empirical\",IF(OR(LoB!AQ13=\"\",ISERROR(MATCH(LoB!AQ13,Empirical!$B$1:$CW$1,0))),\"Not Available\",\"OK\"),IF(AND(VLOOKUP(LoB!AP13,List!$A$2:$E$101,2,FALSE)<>\"\",LoB!AQ13<=VLOOKUP(LoB!AP13,List!$A$2:$E$101,2,FALSE)),\"Too Small\",IF(AND(VLOOKUP(LoB!AP13,List!$A$2:$E$101,3,FALSE)<>\"\",LoB!AQ13>=VLOOKUP(LoB!AP13,List!$A$2:$E$101,3,FALSE)),\"Too Large\",\"OK\"))))","v":""},{"$f":"IF(AP13<>\"OK\",\"\",IF(AND(VLOOKUP(LoB!AP13,List!$A$2:$E$101,4,FALSE)<>\"\",LoB!AR13<=VLOOKUP(LoB!AP13,List!$A$2:$E$101,4,FALSE)),\"Too Small\",IF(AND(VLOOKUP(LoB!AP13,List!$A$2:$E$101,5,FALSE)<>\"\",LoB!AR13>=VLOOKUP(LoB!AP13,List!$A$2:$E$101,5,FALSE)),\"Too Large\",\"OK\")))","v":""},null,{"$f":"IF(AP13<>\"OK\",\"\",IF(AND(LoB!AS13=\"Yes\",LoB!AT13>LoB!AU13),\"Min > Max\",IF(AND(LoB!AS13=\"Yes\",NOT(ISNUMBER(LoB!AT13))),\"Not Number\",\"OK\")))","v":""},{"$f":"IF(AP13<>\"OK\",\"\",IF(AND(LoB!AS13=\"Yes\",LoB!AT13>LoB!AU13),\"Min > Max\",IF(AND(LoB!AS13=\"Yes\",NOT(ISNUMBER(LoB!AU13))),\"Not Number\",\"OK\")))","v":""},{"$f":"IF($E13<>\"Yes\",\"\",IF(ISERROR(MATCH(LoB!AV13,List!$F$2:$F$101,0)),\"Not Available\",\"OK\"))","v":""},{"$f":"IF(AV13<>\"OK\",\"\",IF(LoB!AV13=\"Independent\",\"OK\",IF(OR(AND(LoB!AV13=\"clayton\",LoB!AW13<-1),AND(OR(LoB!AV13=\"gumbel\",LoB!AV13=\"joe\"),LoB!AW13<1),AND(LoB!AV13<>\"normal\",LoB!AV13<>\"t\",LoB!AW13=0)),\"Invalid Value\",IF(AND(OR(LoB!AV13=\"normal\",LoB!AV13=\"t\"),ABS(LoB!AW13)>1),\"|Correlation|>1\",IF(AND(OR(LoB!AV13=\"normal\",LoB!AV13=\"t\"),LoB!AW13=\"\"),\"No Value\",\"OK\")))))","v":""},{"$f":"IF(AV13<>\"OK\",\"\",IF(LoB!AV13=\"Independent\",\"OK\", IF(AND(OR(LoB!AV13=\"normal\",LoB!AV13=\"t\"),1-LoB!AW13*LoB!AX13<0),\"Non Positive Semidefinite\",IF(ABS(LoB!AX13)>1,\"|Correlation|>1\",IF(LoB!AX13=\"\",\"No Value\",\"OK\")))))","v":""},{"$f":"IF(AV13<>\"OK\",\"\",IF(AND(OR(LoB!AV13=\"normal\",LoB!AV13=\"t\"),detm(LoB!AW13,LoB!AX13,LoB!AY13)<0),\"Non Positive Semidefinite\",IF(ABS(LoB!AY13)>1,\"|Correlation >1\",IF(LoB!AY13=\"\",\"\",\"OK\"))))","v":""},{"$f":"IF(AV13<>\"OK\",\"\",IF(AND(LoB!AV13=\"t\",LoB!AZ13<=0),\"Wrong DoF\",\"OK\"))","v":""},{"$f":"IF($E13<>\"Yes\",\"\",IF(OR(LoB!BA13=\"\",AND(ISERROR(MATCH(LoB!BA13,FactorTable!$B$1:$GS$1,0)),ISERROR(MATCH(LoB!BA13,Function!$C$1:$CX$1,0)))),\"Not Available\",\"OK\"))","v":""},{"$f":"IF($E13<>\"Yes\",\"\",IF(OR(LoB!BB13=\"Empirical\",LoB!BB13=\"None\",LoB!BB13=\"Fixed\"),\"OK\",\"Wrong\"))","v":""},{"$f":"IF(BB13<>\"OK\",\"\",IF(LoB!BB13=\"Empirical\",IF(OR(LoB!BC13=\"\",ISERROR(MATCH(LoB!BC13,Empirical!$B$1:$CW$1,0))),\"Not Available\",\"OK\"),IF(AND(LoB!BB13=\"Fixed\",LoB!BC13>=0),\"OK\",\"OK\")))","v":""},{"$f":"IF($E13<>\"Yes\",\"\",IF(OR(LoB!BD13=\"Empirical\",LoB!BD13=\"None\",LoB!BB13=\"Fixed\"),\"OK\",\"Wrong\"))","v":""},{"$f":"IF(BD13<>\"OK\",\"\",IF(LoB!BD13=\"Empirical\",IF(OR(LoB!BE13=\"\",ISERROR(MATCH(LoB!BE13,Empirical!$B$1:$CW$1,0))),\"Not Available\",\"OK\"),IF(AND(LoB!BD13=\"Fixed\",LoB!BE13>=0),\"OK\",\"OK\")))","v":""},{"$f":"IF($E13<>\"Yes\",\"\",IF(OR(LoB!BF13=\"\",ISERROR(MATCH(LoB!BF13,List!$M$2:$M$28,0))),\"Not Available\",\"OK\"))","v":""}]
[null,"Correct",{"$f":"IF(LoB!C14=\"\",\"\",LoB!C14)","v":""},{"$f":"IF(LoB!D14=\"\",\"\",LoB!D14)","v":""},{"$f":"IF(LoB!E14=\"\",\"\",LoB!E14)","v":""},{"$f":"IF($E14<>\"Yes\",\"\",IF(OR(LoB!F14=\"CondPaid\",LoB!F14=\"CondIncurLoss\"),\"OK\",IF(OR(AND(ISERROR(MATCH(LoB!F14,FactorTable!$B$1:$GS$1,0)),ISERROR(MATCH(LoB!F14,Function!$C$1:$CX$1,0)))),\"Not Available\",\"OK\")))","v":""},{"$f":"IF($E14<>\"Yes\",\"\",IF(OR(LoB!G14=\"\",AND(ISERROR(MATCH(LoB!G14,FactorTable!$B$1:$GS$1,0)),ISERROR(MATCH(LoB!G14,Function!$C$1:$CX$1,0)))),\"Not Available\",\"OK\"))","v":""},{"$f":"IF($E14<>\"Yes\",\"\",IF(OR(LoB!H14=\"CondPaid\",LoB!H14=\"CondIncurLoss\"),\"OK\",IF(OR(AND(ISERROR(MATCH(LoB!H14,FactorTable!$B$1:$GS$1,0)),ISERROR(MATCH(LoB!H14,Function!$C$1:$CX$1,0)))),\"Not Available\",\"OK\")))","v":""},{"$f":"IF($E14<>\"Yes\",\"\",IF(ISERROR(MATCH(LoB!I14,List!$A$2:$A$101,0)),\"Not Available\",\"OK\"))","v":""},{"$f":"IF(I14<>\"OK\",\"\",IF(LoB!I14=\"Empirical\",IF(OR(LoB!J14=\"\",ISERROR(MATCH(LoB!J14,Empirical!$B$1:$CW$1,0))),\"Not Available\",\"OK\"),IF(AND(VLOOKUP(LoB!I14,List!$A$2:$E$101,2,FALSE)<>\"\",LoB!J14<=VLOOKUP(LoB!I14,List!$A$2:$E$101,2,FALSE)),\"Too Small\",IF(AND(VLOOKUP(LoB!I14,List!$A$2:$E$101,3,FALSE)<>\"\",LoB!J14>=VLOOKUP(LoB!I14,List!$A$2:$E$101,3,FALSE)),\"Too Large\",\"OK\"))))","v":""},{"$f":"IF(I14<>\"OK\",\"\",IF(AND(VLOOKUP(LoB!I14,List!$A$2:$E$101,4,FALSE)<>\"\",LoB!K14<=VLOOKUP(LoB!I14,List!$A$2:$E$101,4,FALSE)),\"Too Small\",IF(AND(VLOOKUP(LoB!I14,List!$A$2:$E$101,5,FALSE)<>\"\",LoB!K14>=VLOOKUP(LoB!I14,List!$A$2:$E$101,5,FALSE)),\"Too Large\",\"OK\")))","v":""},null,{"$f":"IF(I14<>\"OK\",\"\",IF(AND(LoB!L14=\"Yes\",LoB!M14>LoB!N14),\"Min > Max\",IF(AND(LoB!L14=\"Yes\",NOT(ISNUMBER(LoB!M14))),\"Not Number\",\"OK\")))","v":""},{"$f":"IF(I14<>\"OK\",\"\",IF(AND(LoB!L14=\"Yes\",LoB!M14>LoB!N14),\"Min > Max\",IF(AND(LoB!L14=\"Yes\",NOT(ISNUMBER(LoB!N14))),\"Not Number\",\"OK\")))","v":""},{"$f":"IF($E14<>\"Yes\",\"\",IF(ISERROR(MATCH(LoB!O14,List!$A$2:$A$101,0)),\"Not Available\",\"OK\"))","v":""},{"$f":"IF(O14<>\"OK\",\"\",IF(LoB!O14=\"Empirical\",IF(OR(LoB!P14=\"\",ISERROR(MATCH(LoB!P14,Empirical!$B$1:$CW$1,0))),\"Not Available\",\"OK\"),IF(AND(VLOOKUP(LoB!O14,List!$A$2:$E$101,2,FALSE)<>\"\",LoB!P14<=VLOOKUP(LoB!O14,List!$A$2:$E$101,2,FALSE)),\"Too Small\",IF(AND(VLOOKUP(LoB!O14,List!$A$2:$E$101,3,FALSE)<>\"\",LoB!P14>=VLOOKUP(LoB!O14,List!$A$2:$E$101,3,FALSE)),\"Too Large\",\"OK\"))))","v":""},{"$f":"IF(O14<>\"OK\",\"\",IF(AND(VLOOKUP(LoB!O14,List!$A$2:$E$101,4,FALSE)<>\"\",LoB!Q14<=VLOOKUP(LoB!O14,List!$A$2:$E$101,4,FALSE)),\"Too Small\",IF(AND(VLOOKUP(LoB!O14,List!$A$2:$E$101,5,FALSE)<>\"\",LoB!Q14>=VLOOKUP(LoB!O14,List!$A$2:$E$101,5,FALSE)),\"Too Large\",\"OK\")))","v":""},null,{"$f":"IF(O14<>\"OK\",\"\",IF(AND(LoB!R14=\"Yes\",LoB!S14>LoB!T14),\"Min > Max\",IF(AND(LoB!R14=\"Yes\",NOT(ISNUMBER(LoB!S14))),\"Not Number\",\"OK\")))","v":""},{"$f":"IF(O14<>\"OK\",\"\",IF(AND(LoB!R14=\"Yes\",LoB!S14>LoB!T14),\"Min > Max\",IF(AND(LoB!R14=\"Yes\",NOT(ISNUMBER(LoB!T14))),\"Not Number\",\"OK\")))","v":""},{"$f":"IF($E14<>\"Yes\",\"\",IF(OR(LoB!U14=\"\",ISERROR(MATCH(LoB!U14,Index!$B$1:$CW$1,0))),\"Not Available\",\"OK\"))","v":""},{"$f":"IF($E14<>\"Yes\",\"\",IF(ISERROR(MATCH(LoB!V14,List!$A$2:$A$101,0)),\"Not Available\",\"OK\"))","v":""},{"$f":"IF(V14<>\"OK\",\"\",IF(LoB!V14=\"Empirical\",IF(OR(LoB!W14=\"\",ISERROR(MATCH(LoB!W14,Empirical!$B$1:$CW$1,0))),\"Not Available\",\"OK\"),IF(AND(VLOOKUP(LoB!V14,List!$A$2:$E$101,2,FALSE)<>\"\",LoB!W14<=VLOOKUP(LoB!V14,List!$A$2:$E$101,2,FALSE)),\"Too Small\",IF(AND(VLOOKUP(LoB!V14,List!$A$2:$E$101,3,FALSE)<>\"\",LoB!W14>=VLOOKUP(LoB!V14,List!$A$2:$E$101,3,FALSE)),\"Too Large\",\"OK\"))))","v":""},{"$f":"IF(V14<>\"OK\",\"\",IF(AND(VLOOKUP(LoB!V14,List!$A$2:$E$101,4,FALSE)<>\"\",LoB!X14<=VLOOKUP(LoB!V14,List!$A$2:$E$101,4,FALSE)),\"Too Small\",IF(AND(VLOOKUP(LoB!V14,List!$A$2:$E$101,5,FALSE)<>\"\",LoB!X14>=VLOOKUP(LoB!V14,List!$A$2:$E$101,5,FALSE)),\"Too Large\",\"OK\")))","v":""},null,{"$f":"IF(V14<>\"OK\",\"\",IF(AND(LoB!Y14=\"Yes\",LoB!Z14>LoB!AA14),\"Min > Max\",IF(AND(LoB!Y14=\"Yes\",NOT(ISNUMBER(LoB!Z14))),\"Not Number\",\"OK\")))","v":""},{"$f":"IF(V14<>\"OK\",\"\",IF(AND(LoB!Y14=\"Yes\",LoB!Z14>LoB!AA14),\"Min > Max\",IF(AND(LoB!Y14=\"Yes\",NOT(ISNUMBER(LoB!AA14))),\"Not Number\",\"OK\")))","v":""},{"$f":"IF($E14<>\"Yes\",\"\",IF(OR(LoB!AB14=\"\",ISERROR(MATCH(LoB!AB14,Index!$B$1:$CW$1,0))),\"Not Available\",\"OK\"))","v":""},{"$f":"IF($E14<>\"Yes\",\"\",IF(OR(LoB!AC14=\"CLOSED\",LoB!AC14=\"ALL\"),\"OK\",\"Not Available\"))","v":""},{"$f":"IF($E14<>\"Yes\",\"\",IF(ISERROR(MATCH(LoB!AD14,List!$A$2:$A$101,0)),\"Not Available\",\"OK\"))","v":""},{"$f":"IF(AD14<>\"OK\",\"\",IF(LoB!AD14=\"Empirical\",IF(OR(LoB!AE14=\"\",ISERROR(MATCH(LoB!AE14,Empirical!$B$1:$CW$1,0))),\"Not Available\",\"OK\"),IF(AND(VLOOKUP(LoB!AD14,List!$A$2:$E$101,2,FALSE)<>\"\",LoB!AE14<=VLOOKUP(LoB!AD14,List!$A$2:$E$101,2,FALSE)),\"Too Small\",IF(AND(VLOOKUP(LoB!AD14,List!$A$2:$E$101,3,FALSE)<>\"\",LoB!AE14>=VLOOKUP(LoB!AD14,List!$A$2:$E$101,3,FALSE)),\"Too Large\",\"OK\"))))","v":""},{"$f":"IF(AD14<>\"OK\",\"\",IF(AND(VLOOKUP(LoB!AD14,List!$A$2:$E$101,4,FALSE)<>\"\",LoB!AF14<=VLOOKUP(LoB!AD14,List!$A$2:$E$101,4,FALSE)),\"Too Small\",IF(AND(VLOOKUP(LoB!AD14,List!$A$2:$E$101,5,FALSE)<>\"\",LoB!AF14>=VLOOKUP(LoB!AD14,List!$A$2:$E$101,5,FALSE)),\"Too Large\",\"OK\")))","v":""},null,{"$f":"IF(AD14<>\"OK\",\"\",IF(AND(LoB!AG14=\"Yes\",LoB!AH14>LoB!AI14),\"Min > Max\",IF(AND(LoB!AG14=\"Yes\",NOT(ISNUMBER(LoB!AH14))),\"Not Number\",\"OK\")))","v":""},{"$f":"IF(AD14<>\"OK\",\"\",IF(AND(LoB!AG14=\"Yes\",LoB!AH14>LoB!AI14),\"Min > Max\",IF(AND(LoB!AG14=\"Yes\",NOT(ISNUMBER(LoB!AI14))),\"Not Number\",\"OK\")))","v":""},{"$f":"IF($E14<>\"Yes\",\"\",IF(ISERROR(MATCH(LoB!AJ14,List!$A$2:$A$101,0)),\"Not Available\",\"OK\"))","v":""},{"$f":"IF(AJ14<>\"OK\",\"\",IF(LoB!AJ14=\"Empirical\",IF(OR(LoB!AK14=\"\",ISERROR(MATCH(LoB!AK14,Empirical!$B$1:$CW$1,0))),\"Not Available\",\"OK\"),IF(AND(VLOOKUP(LoB!AJ14,List!$A$2:$E$101,2,FALSE)<>\"\",LoB!AK14<=VLOOKUP(LoB!AJ14,List!$A$2:$E$101,2,FALSE)),\"Too Small\",IF(AND(VLOOKUP(LoB!AJ14,List!$A$2:$E$101,3,FALSE)<>\"\",LoB!AK14>=VLOOKUP(LoB!AJ14,List!$A$2:$E$101,3,FALSE)),\"Too Large\",\"OK\"))))","v":""},{"$f":"IF(AJ14<>\"OK\",\"\",IF(AND(VLOOKUP(LoB!AJ14,List!$A$2:$E$101,4,FALSE)<>\"\",LoB!AL14<=VLOOKUP(LoB!AJ14,List!$A$2:$E$101,4,FALSE)),\"Too Small\",IF(AND(VLOOKUP(LoB!AJ14,List!$A$2:$E$101,5,FALSE)<>\"\",LoB!AL14>=VLOOKUP(LoB!AJ14,List!$A$2:$E$101,5,FALSE)),\"Too Large\",\"OK\")))","v":""},null,{"$f":"IF(AJ14<>\"OK\",\"\",IF(AND(LoB!AM14=\"Yes\",LoB!AN14>LoB!AO14),\"Min > Max\",IF(AND(LoB!AM14=\"Yes\",NOT(ISNUMBER(LoB!AN14))),\"Not Number\",\"OK\")))","v":""},{"$f":"IF(AJ14<>\"OK\",\"\",IF(AND(LoB!AM14=\"Yes\",LoB!AN14>LoB!AO14),\"Min > Max\",IF(AND(LoB!AM14=\"Yes\",NOT(ISNUMBER(LoB!AO14))),\"Not Number\",\"OK\")))","v":""},{"$f":"IF($E14<>\"Yes\",\"\",IF(ISERROR(MATCH(LoB!AP14,List!$A$2:$A$101,0)),\"Not Available\",\"OK\"))","v":""},{"$f":"IF(AP14<>\"OK\",\"\",IF(LoB!AP14=\"Empirical\",IF(OR(LoB!AQ14=\"\",ISERROR(MATCH(LoB!AQ14,Empirical!$B$1:$CW$1,0))),\"Not Available\",\"OK\"),IF(AND(VLOOKUP(LoB!AP14,List!$A$2:$E$101,2,FALSE)<>\"\",LoB!AQ14<=VLOOKUP(LoB!AP14,List!$A$2:$E$101,2,FALSE)),\"Too Small\",IF(AND(VLOOKUP(LoB!AP14,List!$A$2:$E$101,3,FALSE)<>\"\",LoB!AQ14>=VLOOKUP(LoB!AP14,List!$A$2:$E$101,3,FALSE)),\"Too Large\",\"OK\"))))","v":""},{"$f":"IF(AP14<>\"OK\",\"\",IF(AND(VLOOKUP(LoB!AP14,List!$A$2:$E$101,4,FALSE)<>\"\",LoB!AR14<=VLOOKUP(LoB!AP14,List!$A$2:$E$101,4,FALSE)),\"Too Small\",IF(AND(VLOOKUP(LoB!AP14,List!$A$2:$E$101,5,FALSE)<>\"\",LoB!AR14>=VLOOKUP(LoB!AP14,List!$A$2:$E$101,5,FALSE)),\"Too Large\",\"OK\")))","v":""},null,{"$f":"IF(AP14<>\"OK\",\"\",IF(AND(LoB!AS14=\"Yes\",LoB!AT14>LoB!AU14),\"Min > Max\",IF(AND(LoB!AS14=\"Yes\",NOT(ISNUMBER(LoB!AT14))),\"Not Number\",\"OK\")))","v":""},{"$f":"IF(AP14<>\"OK\",\"\",IF(AND(LoB!AS14=\"Yes\",LoB!AT14>LoB!AU14),\"Min > Max\",IF(AND(LoB!AS14=\"Yes\",NOT(ISNUMBER(LoB!AU14))),\"Not Number\",\"OK\")))","v":""},{"$f":"IF($E14<>\"Yes\",\"\",IF(ISERROR(MATCH(LoB!AV14,List!$F$2:$F$101,0)),\"Not Available\",\"OK\"))","v":""},{"$f":"IF(AV14<>\"OK\",\"\",IF(LoB!AV14=\"Independent\",\"OK\",IF(OR(AND(LoB!AV14=\"clayton\",LoB!AW14<-1),AND(OR(LoB!AV14=\"gumbel\",LoB!AV14=\"joe\"),LoB!AW14<1),AND(LoB!AV14<>\"normal\",LoB!AV14<>\"t\",LoB!AW14=0)),\"Invalid Value\",IF(AND(OR(LoB!AV14=\"normal\",LoB!AV14=\"t\"),ABS(LoB!AW14)>1),\"|Correlation|>1\",IF(AND(OR(LoB!AV14=\"normal\",LoB!AV14=\"t\"),LoB!AW14=\"\"),\"No Value\",\"OK\")))))","v":""},{"$f":"IF(AV14<>\"OK\",\"\",IF(LoB!AV14=\"Independent\",\"OK\", IF(AND(OR(LoB!AV14=\"normal\",LoB!AV14=\"t\"),1-LoB!AW14*LoB!AX14<0),\"Non Positive Semidefinite\",IF(ABS(LoB!AX14)>1,\"|Correlation|>1\",IF(LoB!AX14=\"\",\"No Value\",\"OK\")))))","v":""},{"$f":"IF(AV14<>\"OK\",\"\",IF(AND(OR(LoB!AV14=\"normal\",LoB!AV14=\"t\"),detm(LoB!AW14,LoB!AX14,LoB!AY14)<0),\"Non Positive Semidefinite\",IF(ABS(LoB!AY14)>1,\"|Correlation >1\",IF(LoB!AY14=\"\",\"\",\"OK\"))))","v":""},{"$f":"IF(AV14<>\"OK\",\"\",IF(AND(LoB!AV14=\"t\",LoB!AZ14<=0),\"Wrong DoF\",\"OK\"))","v":""},{"$f":"IF($E14<>\"Yes\",\"\",IF(OR(LoB!BA14=\"\",AND(ISERROR(MATCH(LoB!BA14,FactorTable!$B$1:$GS$1,0)),ISERROR(MATCH(LoB!BA14,Function!$C$1:$CX$1,0)))),\"Not Available\",\"OK\"))","v":""},{"$f":"IF($E14<>\"Yes\",\"\",IF(OR(LoB!BB14=\"Empirical\",LoB!BB14=\"None\",LoB!BB14=\"Fixed\"),\"OK\",\"Wrong\"))","v":""},{"$f":"IF(BB14<>\"OK\",\"\",IF(LoB!BB14=\"Empirical\",IF(OR(LoB!BC14=\"\",ISERROR(MATCH(LoB!BC14,Empirical!$B$1:$CW$1,0))),\"Not Available\",\"OK\"),IF(AND(LoB!BB14=\"Fixed\",LoB!BC14>=0),\"OK\",\"OK\")))","v":""},{"$f":"IF($E14<>\"Yes\",\"\",IF(OR(LoB!BD14=\"Empirical\",LoB!BD14=\"None\",LoB!BB14=\"Fixed\"),\"OK\",\"Wrong\"))","v":""},{"$f":"IF(BD14<>\"OK\",\"\",IF(LoB!BD14=\"Empirical\",IF(OR(LoB!BE14=\"\",ISERROR(MATCH(LoB!BE14,Empirical!$B$1:$CW$1,0))),\"Not Available\",\"OK\"),IF(AND(LoB!BD14=\"Fixed\",LoB!BE14>=0),\"OK\",\"OK\")))","v":""},{"$f":"IF($E14<>\"Yes\",\"\",IF(OR(LoB!BF14=\"\",ISERROR(MATCH(LoB!BF14,List!$M$2:$M$28,0))),\"Not Available\",\"OK\"))","v":""}]
[null,"Correct",{"$f":"IF(LoB!C15=\"\",\"\",LoB!C15)","v":""},{"$f":"IF(LoB!D15=\"\",\"\",LoB!D15)","v":""},{"$f":"IF(LoB!E15=\"\",\"\",LoB!E15)","v":""},{"$f":"IF($E15<>\"Yes\",\"\",IF(OR(LoB!F15=\"CondPaid\",LoB!F15=\"CondIncurLoss\"),\"OK\",IF(OR(AND(ISERROR(MATCH(LoB!F15,FactorTable!$B$1:$GS$1,0)),ISERROR(MATCH(LoB!F15,Function!$C$1:$CX$1,0)))),\"Not Available\",\"OK\")))","v":""},{"$f":"IF($E15<>\"Yes\",\"\",IF(OR(LoB!G15=\"\",AND(ISERROR(MATCH(LoB!G15,FactorTable!$B$1:$GS$1,0)),ISERROR(MATCH(LoB!G15,Function!$C$1:$CX$1,0)))),\"Not Available\",\"OK\"))","v":""},{"$f":"IF($E15<>\"Yes\",\"\",IF(OR(LoB!H15=\"CondPaid\",LoB!H15=\"CondIncurLoss\"),\"OK\",IF(OR(AND(ISERROR(MATCH(LoB!H15,FactorTable!$B$1:$GS$1,0)),ISERROR(MATCH(LoB!H15,Function!$C$1:$CX$1,0)))),\"Not Available\",\"OK\")))","v":""},{"$f":"IF($E15<>\"Yes\",\"\",IF(ISERROR(MATCH(LoB!I15,List!$A$2:$A$101,0)),\"Not Available\",\"OK\"))","v":""},{"$f":"IF(I15<>\"OK\",\"\",IF(LoB!I15=\"Empirical\",IF(OR(LoB!J15=\"\",ISERROR(MATCH(LoB!J15,Empirical!$B$1:$CW$1,0))),\"Not Available\",\"OK\"),IF(AND(VLOOKUP(LoB!I15,List!$A$2:$E$101,2,FALSE)<>\"\",LoB!J15<=VLOOKUP(LoB!I15,List!$A$2:$E$101,2,FALSE)),\"Too Small\",IF(AND(VLOOKUP(LoB!I15,List!$A$2:$E$101,3,FALSE)<>\"\",LoB!J15>=VLOOKUP(LoB!I15,List!$A$2:$E$101,3,FALSE)),\"Too Large\",\"OK\"))))","v":""},{"$f":"IF(I15<>\"OK\",\"\",IF(AND(VLOOKUP(LoB!I15,List!$A$2:$E$101,4,FALSE)<>\"\",LoB!K15<=VLOOKUP(LoB!I15,List!$A$2:$E$101,4,FALSE)),\"Too Small\",IF(AND(VLOOKUP(LoB!I15,List!$A$2:$E$101,5,FALSE)<>\"\",LoB!K15>=VLOOKUP(LoB!I15,List!$A$2:$E$101,5,FALSE)),\"Too Large\",\"OK\")))","v":""},null,{"$f":"IF(I15<>\"OK\",\"\",IF(AND(LoB!L15=\"Yes\",LoB!M15>LoB!N15),\"Min > Max\",IF(AND(LoB!L15=\"Yes\",NOT(ISNUMBER(LoB!M15))),\"Not Number\",\"OK\")))","v":""},{"$f":"IF(I15<>\"OK\",\"\",IF(AND(LoB!L15=\"Yes\",LoB!M15>LoB!N15),\"Min > Max\",IF(AND(LoB!L15=\"Yes\",NOT(ISNUMBER(LoB!N15))),\"Not Number\",\"OK\")))","v":""},{"$f":"IF($E15<>\"Yes\",\"\",IF(ISERROR(MATCH(LoB!O15,List!$A$2:$A$101,0)),\"Not Available\",\"OK\"))","v":""},{"$f":"IF(O15<>\"OK\",\"\",IF(LoB!O15=\"Empirical\",IF(OR(LoB!P15=\"\",ISERROR(MATCH(LoB!P15,Empirical!$B$1:$CW$1,0))),\"Not Available\",\"OK\"),IF(AND(VLOOKUP(LoB!O15,List!$A$2:$E$101,2,FALSE)<>\"\",LoB!P15<=VLOOKUP(LoB!O15,List!$A$2:$E$101,2,FALSE)),\"Too Small\",IF(AND(VLOOKUP(LoB!O15,List!$A$2:$E$101,3,FALSE)<>\"\",LoB!P15>=VLOOKUP(LoB!O15,List!$A$2:$E$101,3,FALSE)),\"Too Large\",\"OK\"))))","v":""},{"$f":"IF(O15<>\"OK\",\"\",IF(AND(VLOOKUP(LoB!O15,List!$A$2:$E$101,4,FALSE)<>\"\",LoB!Q15<=VLOOKUP(LoB!O15,List!$A$2:$E$101,4,FALSE)),\"Too Small\",IF(AND(VLOOKUP(LoB!O15,List!$A$2:$E$101,5,FALSE)<>\"\",LoB!Q15>=VLOOKUP(LoB!O15,List!$A$2:$E$101,5,FALSE)),\"Too Large\",\"OK\")))","v":""},null,{"$f":"IF(O15<>\"OK\",\"\",IF(AND(LoB!R15=\"Yes\",LoB!S15>LoB!T15),\"Min > Max\",IF(AND(LoB!R15=\"Yes\",NOT(ISNUMBER(LoB!S15))),\"Not Number\",\"OK\")))","v":""},{"$f":"IF(O15<>\"OK\",\"\",IF(AND(LoB!R15=\"Yes\",LoB!S15>LoB!T15),\"Min > Max\",IF(AND(LoB!R15=\"Yes\",NOT(ISNUMBER(LoB!T15))),\"Not Number\",\"OK\")))","v":""},{"$f":"IF($E15<>\"Yes\",\"\",IF(OR(LoB!U15=\"\",ISERROR(MATCH(LoB!U15,Index!$B$1:$CW$1,0))),\"Not Available\",\"OK\"))","v":""},{"$f":"IF($E15<>\"Yes\",\"\",IF(ISERROR(MATCH(LoB!V15,List!$A$2:$A$101,0)),\"Not Available\",\"OK\"))","v":""},{"$f":"IF(V15<>\"OK\",\"\",IF(LoB!V15=\"Empirical\",IF(OR(LoB!W15=\"\",ISERROR(MATCH(LoB!W15,Empirical!$B$1:$CW$1,0))),\"Not Available\",\"OK\"),IF(AND(VLOOKUP(LoB!V15,List!$A$2:$E$101,2,FALSE)<>\"\",LoB!W15<=VLOOKUP(LoB!V15,List!$A$2:$E$101,2,FALSE)),\"Too Small\",IF(AND(VLOOKUP(LoB!V15,List!$A$2:$E$101,3,FALSE)<>\"\",LoB!W15>=VLOOKUP(LoB!V15,List!$A$2:$E$101,3,FALSE)),\"Too Large\",\"OK\"))))","v":""},{"$f":"IF(V15<>\"OK\",\"\",IF(AND(VLOOKUP(LoB!V15,List!$A$2:$E$101,4,FALSE)<>\"\",LoB!X15<=VLOOKUP(LoB!V15,List!$A$2:$E$101,4,FALSE)),\"Too Small\",IF(AND(VLOOKUP(LoB!V15,List!$A$2:$E$101,5,FALSE)<>\"\",LoB!X15>=VLOOKUP(LoB!V15,List!$A$2:$E$101,5,FALSE)),\"Too Large\",\"OK\")))","v":""},null,{"$f":"IF(V15<>\"OK\",\"\",IF(AND(LoB!Y15=\"Yes\",LoB!Z15>LoB!AA15),\"Min > Max\",IF(AND(LoB!Y15=\"Yes\",NOT(ISNUMBER(LoB!Z15))),\"Not Number\",\"OK\")))","v":""},{"$f":"IF(V15<>\"OK\",\"\",IF(AND(LoB!Y15=\"Yes\",LoB!Z15>LoB!AA15),\"Min > Max\",IF(AND(LoB!Y15=\"Yes\",NOT(ISNUMBER(LoB!AA15))),\"Not Number\",\"OK\")))","v":""},{"$f":"IF($E15<>\"Yes\",\"\",IF(OR(LoB!AB15=\"\",ISERROR(MATCH(LoB!AB15,Index!$B$1:$CW$1,0))),\"Not Available\",\"OK\"))","v":""},{"$f":"IF($E15<>\"Yes\",\"\",IF(OR(LoB!AC15=\"CLOSED\",LoB!AC15=\"ALL\"),\"OK\",\"Not Available\"))","v":""},{"$f":"IF($E15<>\"Yes\",\"\",IF(ISERROR(MATCH(LoB!AD15,List!$A$2:$A$101,0)),\"Not Available\",\"OK\"))","v":""},{"$f":"IF(AD15<>\"OK\",\"\",IF(LoB!AD15=\"Empirical\",IF(OR(LoB!AE15=\"\",ISERROR(MATCH(LoB!AE15,Empirical!$B$1:$CW$1,0))),\"Not Available\",\"OK\"),IF(AND(VLOOKUP(LoB!AD15,List!$A$2:$E$101,2,FALSE)<>\"\",LoB!AE15<=VLOOKUP(LoB!AD15,List!$A$2:$E$101,2,FALSE)),\"Too Small\",IF(AND(VLOOKUP(LoB!AD15,List!$A$2:$E$101,3,FALSE)<>\"\",LoB!AE15>=VLOOKUP(LoB!AD15,List!$A$2:$E$101,3,FALSE)),\"Too Large\",\"OK\"))))","v":""},{"$f":"IF(AD15<>\"OK\",\"\",IF(AND(VLOOKUP(LoB!AD15,List!$A$2:$E$101,4,FALSE)<>\"\",LoB!AF15<=VLOOKUP(LoB!AD15,List!$A$2:$E$101,4,FALSE)),\"Too Small\",IF(AND(VLOOKUP(LoB!AD15,List!$A$2:$E$101,5,FALSE)<>\"\",LoB!AF15>=VLOOKUP(LoB!AD15,List!$A$2:$E$101,5,FALSE)),\"Too Large\",\"OK\")))","v":""},null,{"$f":"IF(AD15<>\"OK\",\"\",IF(AND(LoB!AG15=\"Yes\",LoB!AH15>LoB!AI15),\"Min > Max\",IF(AND(LoB!AG15=\"Yes\",NOT(ISNUMBER(LoB!AH15))),\"Not Number\",\"OK\")))","v":""},{"$f":"IF(AD15<>\"OK\",\"\",IF(AND(LoB!AG15=\"Yes\",LoB!AH15>LoB!AI15),\"Min > Max\",IF(AND(LoB!AG15=\"Yes\",NOT(ISNUMBER(LoB!AI15))),\"Not Number\",\"OK\")))","v":""},{"$f":"IF($E15<>\"Yes\",\"\",IF(ISERROR(MATCH(LoB!AJ15,List!$A$2:$A$101,0)),\"Not Available\",\"OK\"))","v":""},{"$f":"IF(AJ15<>\"OK\",\"\",IF(LoB!AJ15=\"Empirical\",IF(OR(LoB!AK15=\"\",ISERROR(MATCH(LoB!AK15,Empirical!$B$1:$CW$1,0))),\"Not Available\",\"OK\"),IF(AND(VLOOKUP(LoB!AJ15,List!$A$2:$E$101,2,FALSE)<>\"\",LoB!AK15<=VLOOKUP(LoB!AJ15,List!$A$2:$E$101,2,FALSE)),\"Too Small\",IF(AND(VLOOKUP(LoB!AJ15,List!$A$2:$E$101,3,FALSE)<>\"\",LoB!AK15>=VLOOKUP(LoB!AJ15,List!$A$2:$E$101,3,FALSE)),\"Too Large\",\"OK\"))))","v":""},{"$f":"IF(AJ15<>\"OK\",\"\",IF(AND(VLOOKUP(LoB!AJ15,List!$A$2:$E$101,4,FALSE)<>\"\",LoB!AL15<=VLOOKUP(LoB!AJ15,List!$A$2:$E$101,4,FALSE)),\"Too Small\",IF(AND(VLOOKUP(LoB!AJ15,List!$A$2:$E$101,5,FALSE)<>\"\",LoB!AL15>=VLOOKUP(LoB!AJ15,List!$A$2:$E$101,5,FALSE)),\"Too Large\",\"OK\")))","v":""},null,{"$f":"IF(AJ15<>\"OK\",\"\",IF(AND(LoB!AM15=\"Yes\",LoB!AN15>LoB!AO15),\"Min > Max\",IF(AND(LoB!AM15=\"Yes\",NOT(ISNUMBER(LoB!AN15))),\"Not Number\",\"OK\")))","v":""},{"$f":"IF(AJ15<>\"OK\",\"\",IF(AND(LoB!AM15=\"Yes\",LoB!AN15>LoB!AO15),\"Min > Max\",IF(AND(LoB!AM15=\"Yes\",NOT(ISNUMBER(LoB!AO15))),\"Not Number\",\"OK\")))","v":""},{"$f":"IF($E15<>\"Yes\",\"\",IF(ISERROR(MATCH(LoB!AP15,List!$A$2:$A$101,0)),\"Not Available\",\"OK\"))","v":""},{"$f":"IF(AP15<>\"OK\",\"\",IF(LoB!AP15=\"Empirical\",IF(OR(LoB!AQ15=\"\",ISERROR(MATCH(LoB!AQ15,Empirical!$B$1:$CW$1,0))),\"Not Available\",\"OK\"),IF(AND(VLOOKUP(LoB!AP15,List!$A$2:$E$101,2,FALSE)<>\"\",LoB!AQ15<=VLOOKUP(LoB!AP15,List!$A$2:$E$101,2,FALSE)),\"Too Small\",IF(AND(VLOOKUP(LoB!AP15,List!$A$2:$E$101,3,FALSE)<>\"\",LoB!AQ15>=VLOOKUP(LoB!AP15,List!$A$2:$E$101,3,FALSE)),\"Too Large\",\"OK\"))))","v":""},{"$f":"IF(AP15<>\"OK\",\"\",IF(AND(VLOOKUP(LoB!AP15,List!$A$2:$E$101,4,FALSE)<>\"\",LoB!AR15<=VLOOKUP(LoB!AP15,List!$A$2:$E$101,4,FALSE)),\"Too Small\",IF(AND(VLOOKUP(LoB!AP15,List!$A$2:$E$101,5,FALSE)<>\"\",LoB!AR15>=VLOOKUP(LoB!AP15,List!$A$2:$E$101,5,FALSE)),\"Too Large\",\"OK\")))","v":""},null,{"$f":"IF(AP15<>\"OK\",\"\",IF(AND(LoB!AS15=\"Yes\",LoB!AT15>LoB!AU15),\"Min > Max\",IF(AND(LoB!AS15=\"Yes\",NOT(ISNUMBER(LoB!AT15))),\"Not Number\",\"OK\")))","v":""},{"$f":"IF(AP15<>\"OK\",\"\",IF(AND(LoB!AS15=\"Yes\",LoB!AT15>LoB!AU15),\"Min > Max\",IF(AND(LoB!AS15=\"Yes\",NOT(ISNUMBER(LoB!AU15))),\"Not Number\",\"OK\")))","v":""},{"$f":"IF($E15<>\"Yes\",\"\",IF(ISERROR(MATCH(LoB!AV15,List!$F$2:$F$101,0)),\"Not Available\",\"OK\"))","v":""},{"$f":"IF(AV15<>\"OK\",\"\",IF(LoB!AV15=\"Independent\",\"OK\",IF(OR(AND(LoB!AV15=\"clayton\",LoB!AW15<-1),AND(OR(LoB!AV15=\"gumbel\",LoB!AV15=\"joe\"),LoB!AW15<1),AND(LoB!AV15<>\"normal\",LoB!AV15<>\"t\",LoB!AW15=0)),\"Invalid Value\",IF(AND(OR(LoB!AV15=\"normal\",LoB!AV15=\"t\"),ABS(LoB!AW15)>1),\"|Correlation|>1\",IF(AND(OR(LoB!AV15=\"normal\",LoB!AV15=\"t\"),LoB!AW15=\"\"),\"No Value\",\"OK\")))))","v":""},{"$f":"IF(AV15<>\"OK\",\"\",IF(LoB!AV15=\"Independent\",\"OK\", IF(AND(OR(LoB!AV15=\"normal\",LoB!AV15=\"t\"),1-LoB!AW15*LoB!AX15<0),\"Non Positive Semidefinite\",IF(ABS(LoB!AX15)>1,\"|Correlation|>1\",IF(LoB!AX15=\"\",\"No Value\",\"OK\")))))","v":""},{"$f":"IF(AV15<>\"OK\",\"\",IF(AND(OR(LoB!AV15=\"normal\",LoB!AV15=\"t\"),detm(LoB!AW15,LoB!AX15,LoB!AY15)<0),\"Non Positive Semidefinite\",IF(ABS(LoB!AY15)>1,\"|Correlation >1\",IF(LoB!AY15=\"\",\"\",\"OK\"))))","v":""},{"$f":"IF(AV15<>\"OK\",\"\",IF(AND(LoB!AV15=\"t\",LoB!AZ15<=0),\"Wrong DoF\",\"OK\"))","v":""},{"$f":"IF($E15<>\"Yes\",\"\",IF(OR(LoB!BA15=\"\",AND(ISERROR(MATCH(LoB!BA15,FactorTable!$B$1:$GS$1,0)),ISERROR(MATCH(LoB!BA15,Function!$C$1:$CX$1,0)))),\"Not Available\",\"OK\"))","v":""},{"$f":"IF($E15<>\"Yes\",\"\",IF(OR(LoB!BB15=\"Empirical\",LoB!BB15=\"None\",LoB!BB15=\"Fixed\"),\"OK\",\"Wrong\"))","v":""},{"$f":"IF(BB15<>\"OK\",\"\",IF(LoB!BB15=\"Empirical\",IF(OR(LoB!BC15=\"\",ISERROR(MATCH(LoB!BC15,Empirical!$B$1:$CW$1,0))),\"Not Available\",\"OK\"),IF(AND(LoB!BB15=\"Fixed\",LoB!BC15>=0),\"OK\",\"OK\")))","v":""},{"$f":"IF($E15<>\"Yes\",\"\",IF(OR(LoB!BD15=\"Empirical\",LoB!BD15=\"None\",LoB!BB15=\"Fixed\"),\"OK\",\"Wrong\"))","v":""},{"$f":"IF(BD15<>\"OK\",\"\",IF(LoB!BD15=\"Empirical\",IF(OR(LoB!BE15=\"\",ISERROR(MATCH(LoB!BE15,Empirical!$B$1:$CW$1,0))),\"Not Available\",\"OK\"),IF(AND(LoB!BD15=\"Fixed\",LoB!BE15>=0),\"OK\",\"OK\")))","v":""},{"$f":"IF($E15<>\"Yes\",\"\",IF(OR(LoB!BF15=\"\",ISERROR(MATCH(LoB!BF15,List!$M$2:$M$28,0))),\"Not Available\",\"OK\"))","v":""}]
[null,"Correct",{"$f":"IF(LoB!C16=\"\",\"\",LoB!C16)","v":""},{"$f":"IF(LoB!D16=\"\",\"\",LoB!D16)","v":""},{"$f":"IF(LoB!E16=\"\",\"\",LoB!E16)","v":""},{"$f":"IF($E16<>\"Yes\",\"\",IF(OR(LoB!F16=\"CondPaid\",LoB!F16=\"CondIncurLoss\"),\"OK\",IF(OR(AND(ISERROR(MATCH(LoB!F16,FactorTable!$B$1:$GS$1,0)),ISERROR(MATCH(LoB!F16,Function!$C$1:$CX$1,0)))),\"Not Available\",\"OK\")))","v":""},{"$f":"IF($E16<>\"Yes\",\"\",IF(OR(LoB!G16=\"\",AND(ISERROR(MATCH(LoB!G16,FactorTable!$B$1:$GS$1,0)),ISERROR(MATCH(LoB!G16,Function!$C$1:$CX$1,0)))),\"Not Available\",\"OK\"))","v":""},{"$f":"IF($E16<>\"Yes\",\"\",IF(OR(LoB!H16=\"CondPaid\",LoB!H16=\"CondIncurLoss\"),\"OK\",IF(OR(AND(ISERROR(MATCH(LoB!H16,FactorTable!$B$1:$GS$1,0)),ISERROR(MATCH(LoB!H16,Function!$C$1:$CX$1,0)))),\"Not Available\",\"OK\")))","v":""},{"$f":"IF($E16<>\"Yes\",\"\",IF(ISERROR(MATCH(LoB!I16,List!$A$2:$A$101,0)),\"Not Available\",\"OK\"))","v":""},{"$f":"IF(I16<>\"OK\",\"\",IF(LoB!I16=\"Empirical\",IF(OR(LoB!J16=\"\",ISERROR(MATCH(LoB!J16,Empirical!$B$1:$CW$1,0))),\"Not Available\",\"OK\"),IF(AND(VLOOKUP(LoB!I16,List!$A$2:$E$101,2,FALSE)<>\"\",LoB!J16<=VLOOKUP(LoB!I16,List!$A$2:$E$101,2,FALSE)),\"Too Small\",IF(AND(VLOOKUP(LoB!I16,List!$A$2:$E$101,3,FALSE)<>\"\",LoB!J16>=VLOOKUP(LoB!I16,List!$A$2:$E$101,3,FALSE)),\"Too Large\",\"OK\"))))","v":""},{"$f":"IF(I16<>\"OK\",\"\",IF(AND(VLOOKUP(LoB!I16,List!$A$2:$E$101,4,FALSE)<>\"\",LoB!K16<=VLOOKUP(LoB!I16,List!$A$2:$E$101,4,FALSE)),\"Too Small\",IF(AND(VLOOKUP(LoB!I16,List!$A$2:$E$101,5,FALSE)<>\"\",LoB!K16>=VLOOKUP(LoB!I16,List!$A$2:$E$101,5,FALSE)),\"Too Large\",\"OK\")))","v":""},null,{"$f":"IF(I16<>\"OK\",\"\",IF(AND(LoB!L16=\"Yes\",LoB!M16>LoB!N16),\"Min > Max\",IF(AND(LoB!L16=\"Yes\",NOT(ISNUMBER(LoB!M16))),\"Not Number\",\"OK\")))","v":""},{"$f":"IF(I16<>\"OK\",\"\",IF(AND(LoB!L16=\"Yes\",LoB!M16>LoB!N16),\"Min > Max\",IF(AND(LoB!L16=\"Yes\",NOT(ISNUMBER(LoB!N16))),\"Not Number\",\"OK\")))","v":""},{"$f":"IF($E16<>\"Yes\",\"\",IF(ISERROR(MATCH(LoB!O16,List!$A$2:$A$101,0)),\"Not Available\",\"OK\"))","v":""},{"$f":"IF(O16<>\"OK\",\"\",IF(LoB!O16=\"Empirical\",IF(OR(LoB!P16=\"\",ISERROR(MATCH(LoB!P16,Empirical!$B$1:$CW$1,0))),\"Not Available\",\"OK\"),IF(AND(VLOOKUP(LoB!O16,List!$A$2:$E$101,2,FALSE)<>\"\",LoB!P16<=VLOOKUP(LoB!O16,List!$A$2:$E$101,2,FALSE)),\"Too Small\",IF(AND(VLOOKUP(LoB!O16,List!$A$2:$E$101,3,FALSE)<>\"\",LoB!P16>=VLOOKUP(LoB!O16,List!$A$2:$E$101,3,FALSE)),\"Too Large\",\"OK\"))))","v":""},{"$f":"IF(O16<>\"OK\",\"\",IF(AND(VLOOKUP(LoB!O16,List!$A$2:$E$101,4,FALSE)<>\"\",LoB!Q16<=VLOOKUP(LoB!O16,List!$A$2:$E$101,4,FALSE)),\"Too Small\",IF(AND(VLOOKUP(LoB!O16,List!$A$2:$E$101,5,FALSE)<>\"\",LoB!Q16>=VLOOKUP(LoB!O16,List!$A$2:$E$101,5,FALSE)),\"Too Large\",\"OK\")))","v":""},null,{"$f":"IF(O16<>\"OK\",\"\",IF(AND(LoB!R16=\"Yes\",LoB!S16>LoB!T16),\"Min > Max\",IF(AND(LoB!R16=\"Yes\",NOT(ISNUMBER(LoB!S16))),\"Not Number\",\"OK\")))","v":""},{"$f":"IF(O16<>\"OK\",\"\",IF(AND(LoB!R16=\"Yes\",LoB!S16>LoB!T16),\"Min > Max\",IF(AND(LoB!R16=\"Yes\",NOT(ISNUMBER(LoB!T16))),\"Not Number\",\"OK\")))","v":""},{"$f":"IF($E16<>\"Yes\",\"\",IF(OR(LoB!U16=\"\",ISERROR(MATCH(LoB!U16,Index!$B$1:$CW$1,0))),\"Not Available\",\"OK\"))","v":""},{"$f":"IF($E16<>\"Yes\",\"\",IF(ISERROR(MATCH(LoB!V16,List!$A$2:$A$101,0)),\"Not Available\",\"OK\"))","v":""},{"$f":"IF(V16<>\"OK\",\"\",IF(LoB!V16=\"Empirical\",IF(OR(LoB!W16=\"\",ISERROR(MATCH(LoB!W16,Empirical!$B$1:$CW$1,0))),\"Not Available\",\"OK\"),IF(AND(VLOOKUP(LoB!V16,List!$A$2:$E$101,2,FALSE)<>\"\",LoB!W16<=VLOOKUP(LoB!V16,List!$A$2:$E$101,2,FALSE)),\"Too Small\",IF(AND(VLOOKUP(LoB!V16,List!$A$2:$E$101,3,FALSE)<>\"\",LoB!W16>=VLOOKUP(LoB!V16,List!$A$2:$E$101,3,FALSE)),\"Too Large\",\"OK\"))))","v":""},{"$f":"IF(V16<>\"OK\",\"\",IF(AND(VLOOKUP(LoB!V16,List!$A$2:$E$101,4,FALSE)<>\"\",LoB!X16<=VLOOKUP(LoB!V16,List!$A$2:$E$101,4,FALSE)),\"Too Small\",IF(AND(VLOOKUP(LoB!V16,List!$A$2:$E$101,5,FALSE)<>\"\",LoB!X16>=VLOOKUP(LoB!V16,List!$A$2:$E$101,5,FALSE)),\"Too Large\",\"OK\")))","v":""},null,{"$f":"IF(V16<>\"OK\",\"\",IF(AND(LoB!Y16=\"Yes\",LoB!Z16>LoB!AA16),\"Min > Max\",IF(AND(LoB!Y16=\"Yes\",NOT(ISNUMBER(LoB!Z16))),\"Not Number\",\"OK\")))","v":""},{"$f":"IF(V16<>\"OK\",\"\",IF(AND(LoB!Y16=\"Yes\",LoB!Z16>LoB!AA16),\"Min > Max\",IF(AND(LoB!Y16=\"Yes\",NOT(ISNUMBER(LoB!AA16))),\"Not Number\",\"OK\")))","v":""},{"$f":"IF($E16<>\"Yes\",\"\",IF(OR(LoB!AB16=\"\",ISERROR(MATCH(LoB!AB16,Index!$B$1:$CW$1,0))),\"Not Available\",\"OK\"))","v":""},{"$f":"IF($E16<>\"Yes\",\"\",IF(OR(LoB!AC16=\"CLOSED\",LoB!AC16=\"ALL\"),\"OK\",\"Not Available\"))","v":""},{"$f":"IF($E16<>\"Yes\",\"\",IF(ISERROR(MATCH(LoB!AD16,List!$A$2:$A$101,0)),\"Not Available\",\"OK\"))","v":""},{"$f":"IF(AD16<>\"OK\",\"\",IF(LoB!AD16=\"Empirical\",IF(OR(LoB!AE16=\"\",ISERROR(MATCH(LoB!AE16,Empirical!$B$1:$CW$1,0))),\"Not Available\",\"OK\"),IF(AND(VLOOKUP(LoB!AD16,List!$A$2:$E$101,2,FALSE)<>\"\",LoB!AE16<=VLOOKUP(LoB!AD16,List!$A$2:$E$101,2,FALSE)),\"Too Small\",IF(AND(VLOOKUP(LoB!AD16,List!$A$2:$E$101,3,FALSE)<>\"\",LoB!AE16>=VLOOKUP(LoB!AD16,List!$A$2:$E$101,3,FALSE)),\"Too Large\",\"OK\"))))","v":""},{"$f":"IF(AD16<>\"OK\",\"\",IF(AND(VLOOKUP(LoB!AD16,List!$A$2:$E$101,4,FALSE)<>\"\",LoB!AF16<=VLOOKUP(LoB!AD16,List!$A$2:$E$101,4,FALSE)),\"Too Small\",IF(AND(VLOOKUP(LoB!AD16,List!$A$2:$E$101,5,FALSE)<>\"\",LoB!AF16>=VLOOKUP(LoB!AD16,List!$A$2:$E$101,5,FALSE)),\"Too Large\",\"OK\")))","v":""},null,{"$f":"IF(AD16<>\"OK\",\"\",IF(AND(LoB!AG16=\"Yes\",LoB!AH16>LoB!AI16),\"Min > Max\",IF(AND(LoB!AG16=\"Yes\",NOT(ISNUMBER(LoB!AH16))),\"Not Number\",\"OK\")))","v":""},{"$f":"IF(AD16<>\"OK\",\"\",IF(AND(LoB!AG16=\"Yes\",LoB!AH16>LoB!AI16),\"Min > Max\",IF(AND(LoB!AG16=\"Yes\",NOT(ISNUMBER(LoB!AI16))),\"Not Number\",\"OK\")))","v":""},{"$f":"IF($E16<>\"Yes\",\"\",IF(ISERROR(MATCH(LoB!AJ16,List!$A$2:$A$101,0)),\"Not Available\",\"OK\"))","v":""},{"$f":"IF(AJ16<>\"OK\",\"\",IF(LoB!AJ16=\"Empirical\",IF(OR(LoB!AK16=\"\",ISERROR(MATCH(LoB!AK16,Empirical!$B$1:$CW$1,0))),\"Not Available\",\"OK\"),IF(AND(VLOOKUP(LoB!AJ16,List!$A$2:$E$101,2,FALSE)<>\"\",LoB!AK16<=VLOOKUP(LoB!AJ16,List!$A$2:$E$101,2,FALSE)),\"Too Small\",IF(AND(VLOOKUP(LoB!AJ16,List!$A$2:$E$101,3,FALSE)<>\"\",LoB!AK16>=VLOOKUP(LoB!AJ16,List!$A$2:$E$101,3,FALSE)),\"Too Large\",\"OK\"))))","v":""},{"$f":"IF(AJ16<>\"OK\",\"\",IF(AND(VLOOKUP(LoB!AJ16,List!$A$2:$E$101,4,FALSE)<>\"\",LoB!AL16<=VLOOKUP(LoB!AJ16,List!$A$2:$E$101,4,FALSE)),\"Too Small\",IF(AND(VLOOKUP(LoB!AJ16,List!$A$2:$E$101,5,FALSE)<>\"\",LoB!AL16>=VLOOKUP(LoB!AJ16,List!$A$2:$E$101,5,FALSE)),\"Too Large\",\"OK\")))","v":""},null,{"$f":"IF(AJ16<>\"OK\",\"\",IF(AND(LoB!AM16=\"Yes\",LoB!AN16>LoB!AO16),\"Min > Max\",IF(AND(LoB!AM16=\"Yes\",NOT(ISNUMBER(LoB!AN16))),\"Not Number\",\"OK\")))","v":""},{"$f":"IF(AJ16<>\"OK\",\"\",IF(AND(LoB!AM16=\"Yes\",LoB!AN16>LoB!AO16),\"Min > Max\",IF(AND(LoB!AM16=\"Yes\",NOT(ISNUMBER(LoB!AO16))),\"Not Number\",\"OK\")))","v":""},{"$f":"IF($E16<>\"Yes\",\"\",IF(ISERROR(MATCH(LoB!AP16,List!$A$2:$A$101,0)),\"Not Available\",\"OK\"))","v":""},{"$f":"IF(AP16<>\"OK\",\"\",IF(LoB!AP16=\"Empirical\",IF(OR(LoB!AQ16=\"\",ISERROR(MATCH(LoB!AQ16,Empirical!$B$1:$CW$1,0))),\"Not Available\",\"OK\"),IF(AND(VLOOKUP(LoB!AP16,List!$A$2:$E$101,2,FALSE)<>\"\",LoB!AQ16<=VLOOKUP(LoB!AP16,List!$A$2:$E$101,2,FALSE)),\"Too Small\",IF(AND(VLOOKUP(LoB!AP16,List!$A$2:$E$101,3,FALSE)<>\"\",LoB!AQ16>=VLOOKUP(LoB!AP16,List!$A$2:$E$101,3,FALSE)),\"Too Large\",\"OK\"))))","v":""},{"$f":"IF(AP16<>\"OK\",\"\",IF(AND(VLOOKUP(LoB!AP16,List!$A$2:$E$101,4,FALSE)<>\"\",LoB!AR16<=VLOOKUP(LoB!AP16,List!$A$2:$E$101,4,FALSE)),\"Too Small\",IF(AND(VLOOKUP(LoB!AP16,List!$A$2:$E$101,5,FALSE)<>\"\",LoB!AR16>=VLOOKUP(LoB!AP16,List!$A$2:$E$101,5,FALSE)),\"Too Large\",\"OK\")))","v":""},null,{"$f":"IF(AP16<>\"OK\",\"\",IF(AND(LoB!AS16=\"Yes\",LoB!AT16>LoB!AU16),\"Min > Max\",IF(AND(LoB!AS16=\"Yes\",NOT(ISNUMBER(LoB!AT16))),\"Not Number\",\"OK\")))","v":""},{"$f":"IF(AP16<>\"OK\",\"\",IF(AND(LoB!AS16=\"Yes\",LoB!AT16>LoB!AU16),\"Min > Max\",IF(AND(LoB!AS16=\"Yes\",NOT(ISNUMBER(LoB!AU16))),\"Not Number\",\"OK\")))","v":""},{"$f":"IF($E16<>\"Yes\",\"\",IF(ISERROR(MATCH(LoB!AV16,List!$F$2:$F$101,0)),\"Not Available\",\"OK\"))","v":""},{"$f":"IF(AV16<>\"OK\",\"\",IF(LoB!AV16=\"Independent\",\"OK\",IF(OR(AND(LoB!AV16=\"clayton\",LoB!AW16<-1),AND(OR(LoB!AV16=\"gumbel\",LoB!AV16=\"joe\"),LoB!AW16<1),AND(LoB!AV16<>\"normal\",LoB!AV16<>\"t\",LoB!AW16=0)),\"Invalid Value\",IF(AND(OR(LoB!AV16=\"normal\",LoB!AV16=\"t\"),ABS(LoB!AW16)>1),\"|Correlation|>1\",IF(AND(OR(LoB!AV16=\"normal\",LoB!AV16=\"t\"),LoB!AW16=\"\"),\"No Value\",\"OK\")))))","v":""},{"$f":"IF(AV16<>\"OK\",\"\",IF(LoB!AV16=\"Independent\",\"OK\", IF(AND(OR(LoB!AV16=\"normal\",LoB!AV16=\"t\"),1-LoB!AW16*LoB!AX16<0),\"Non Positive Semidefinite\",IF(ABS(LoB!AX16)>1,\"|Correlation|>1\",IF(LoB!AX16=\"\",\"No Value\",\"OK\")))))","v":""},{"$f":"IF(AV16<>\"OK\",\"\",IF(AND(OR(LoB!AV16=\"normal\",LoB!AV16=\"t\"),detm(LoB!AW16,LoB!AX16,LoB!AY16)<0),\"Non Positive Semidefinite\",IF(ABS(LoB!AY16)>1,\"|Correlation >1\",IF(LoB!AY16=\"\",\"\",\"OK\"))))","v":""},{"$f":"IF(AV16<>\"OK\",\"\",IF(AND(LoB!AV16=\"t\",LoB!AZ16<=0),\"Wrong DoF\",\"OK\"))","v":""},{"$f":"IF($E16<>\"Yes\",\"\",IF(OR(LoB!BA16=\"\",AND(ISERROR(MATCH(LoB!BA16,FactorTable!$B$1:$GS$1,0)),ISERROR(MATCH(LoB!BA16,Function!$C$1:$CX$1,0)))),\"Not Available\",\"OK\"))","v":""},{"$f":"IF($E16<>\"Yes\",\"\",IF(OR(LoB!BB16=\"Empirical\",LoB!BB16=\"None\",LoB!BB16=\"Fixed\"),\"OK\",\"Wrong\"))","v":""},{"$f":"IF(BB16<>\"OK\",\"\",IF(LoB!BB16=\"Empirical\",IF(OR(LoB!BC16=\"\",ISERROR(MATCH(LoB!BC16,Empirical!$B$1:$CW$1,0))),\"Not Available\",\"OK\"),IF(AND(LoB!BB16=\"Fixed\",LoB!BC16>=0),\"OK\",\"OK\")))","v":""},{"$f":"IF($E16<>\"Yes\",\"\",IF(OR(LoB!BD16=\"Empirical\",LoB!BD16=\"None\",LoB!BB16=\"Fixed\"),\"OK\",\"Wrong\"))","v":""},{"$f":"IF(BD16<>\"OK\",\"\",IF(LoB!BD16=\"Empirical\",IF(OR(LoB!BE16=\"\",ISERROR(MATCH(LoB!BE16,Empirical!$B$1:$CW$1,0))),\"Not Available\",\"OK\"),IF(AND(LoB!BD16=\"Fixed\",LoB!BE16>=0),\"OK\",\"OK\")))","v":""},{"$f":"IF($E16<>\"Yes\",\"\",IF(OR(LoB!BF16=\"\",ISERROR(MATCH(LoB!BF16,List!$M$2:$M$28,0))),\"Not Available\",\"OK\"))","v":""}]
[null,"Correct",{"$f":"IF(LoB!C17=\"\",\"\",LoB!C17)","v":""},{"$f":"IF(LoB!D17=\"\",\"\",LoB!D17)","v":""},{"$f":"IF(LoB!E17=\"\",\"\",LoB!E17)","v":""},{"$f":"IF($E17<>\"Yes\",\"\",IF(OR(LoB!F17=\"CondPaid\",LoB!F17=\"CondIncurLoss\"),\"OK\",IF(OR(AND(ISERROR(MATCH(LoB!F17,FactorTable!$B$1:$GS$1,0)),ISERROR(MATCH(LoB!F17,Function!$C$1:$CX$1,0)))),\"Not Available\",\"OK\")))","v":""},{"$f":"IF($E17<>\"Yes\",\"\",IF(OR(LoB!G17=\"\",AND(ISERROR(MATCH(LoB!G17,FactorTable!$B$1:$GS$1,0)),ISERROR(MATCH(LoB!G17,Function!$C$1:$CX$1,0)))),\"Not Available\",\"OK\"))","v":""},{"$f":"IF($E17<>\"Yes\",\"\",IF(OR(LoB!H17=\"CondPaid\",LoB!H17=\"CondIncurLoss\"),\"OK\",IF(OR(AND(ISERROR(MATCH(LoB!H17,FactorTable!$B$1:$GS$1,0)),ISERROR(MATCH(LoB!H17,Function!$C$1:$CX$1,0)))),\"Not Available\",\"OK\")))","v":""},{"$f":"IF($E17<>\"Yes\",\"\",IF(ISERROR(MATCH(LoB!I17,List!$A$2:$A$101,0)),\"Not Available\",\"OK\"))","v":""},{"$f":"IF(I17<>\"OK\",\"\",IF(LoB!I17=\"Empirical\",IF(OR(LoB!J17=\"\",ISERROR(MATCH(LoB!J17,Empirical!$B$1:$CW$1,0))),\"Not Available\",\"OK\"),IF(AND(VLOOKUP(LoB!I17,List!$A$2:$E$101,2,FALSE)<>\"\",LoB!J17<=VLOOKUP(LoB!I17,List!$A$2:$E$101,2,FALSE)),\"Too Small\",IF(AND(VLOOKUP(LoB!I17,List!$A$2:$E$101,3,FALSE)<>\"\",LoB!J17>=VLOOKUP(LoB!I17,List!$A$2:$E$101,3,FALSE)),\"Too Large\",\"OK\"))))","v":""},{"$f":"IF(I17<>\"OK\",\"\",IF(AND(VLOOKUP(LoB!I17,List!$A$2:$E$101,4,FALSE)<>\"\",LoB!K17<=VLOOKUP(LoB!I17,List!$A$2:$E$101,4,FALSE)),\"Too Small\",IF(AND(VLOOKUP(LoB!I17,List!$A$2:$E$101,5,FALSE)<>\"\",LoB!K17>=VLOOKUP(LoB!I17,List!$A$2:$E$101,5,FALSE)),\"Too Large\",\"OK\")))","v":""},null,{"$f":"IF(I17<>\"OK\",\"\",IF(AND(LoB!L17=\"Yes\",LoB!M17>LoB!N17),\"Min > Max\",IF(AND(LoB!L17=\"Yes\",NOT(ISNUMBER(LoB!M17))),\"Not Number\",\"OK\")))","v":""},{"$f":"IF(I17<>\"OK\",\"\",IF(AND(LoB!L17=\"Yes\",LoB!M17>LoB!N17),\"Min > Max\",IF(AND(LoB!L17=\"Yes\",NOT(ISNUMBER(LoB!N17))),\"Not Number\",\"OK\")))","v":""},{"$f":"IF($E17<>\"Yes\",\"\",IF(ISERROR(MATCH(LoB!O17,List!$A$2:$A$101,0)),\"Not Available\",\"OK\"))","v":""},{"$f":"IF(O17<>\"OK\",\"\",IF(LoB!O17=\"Empirical\",IF(OR(LoB!P17=\"\",ISERROR(MATCH(LoB!P17,Empirical!$B$1:$CW$1,0))),\"Not Available\",\"OK\"),IF(AND(VLOOKUP(LoB!O17,List!$A$2:$E$101,2,FALSE)<>\"\",LoB!P17<=VLOOKUP(LoB!O17,List!$A$2:$E$101,2,FALSE)),\"Too Small\",IF(AND(VLOOKUP(LoB!O17,List!$A$2:$E$101,3,FALSE)<>\"\",LoB!P17>=VLOOKUP(LoB!O17,List!$A$2:$E$101,3,FALSE)),\"Too Large\",\"OK\"))))","v":""},{"$f":"IF(O17<>\"OK\",\"\",IF(AND(VLOOKUP(LoB!O17,List!$A$2:$E$101,4,FALSE)<>\"\",LoB!Q17<=VLOOKUP(LoB!O17,List!$A$2:$E$101,4,FALSE)),\"Too Small\",IF(AND(VLOOKUP(LoB!O17,List!$A$2:$E$101,5,FALSE)<>\"\",LoB!Q17>=VLOOKUP(LoB!O17,List!$A$2:$E$101,5,FALSE)),\"Too Large\",\"OK\")))","v":""},null,{"$f":"IF(O17<>\"OK\",\"\",IF(AND(LoB!R17=\"Yes\",LoB!S17>LoB!T17),\"Min > Max\",IF(AND(LoB!R17=\"Yes\",NOT(ISNUMBER(LoB!S17))),\"Not Number\",\"OK\")))","v":""},{"$f":"IF(O17<>\"OK\",\"\",IF(AND(LoB!R17=\"Yes\",LoB!S17>LoB!T17),\"Min > Max\",IF(AND(LoB!R17=\"Yes\",NOT(ISNUMBER(LoB!T17))),\"Not Number\",\"OK\")))","v":""},{"$f":"IF($E17<>\"Yes\",\"\",IF(OR(LoB!U17=\"\",ISERROR(MATCH(LoB!U17,Index!$B$1:$CW$1,0))),\"Not Available\",\"OK\"))","v":""},{"$f":"IF($E17<>\"Yes\",\"\",IF(ISERROR(MATCH(LoB!V17,List!$A$2:$A$101,0)),\"Not Available\",\"OK\"))","v":""},{"$f":"IF(V17<>\"OK\",\"\",IF(LoB!V17=\"Empirical\",IF(OR(LoB!W17=\"\",ISERROR(MATCH(LoB!W17,Empirical!$B$1:$CW$1,0))),\"Not Available\",\"OK\"),IF(AND(VLOOKUP(LoB!V17,List!$A$2:$E$101,2,FALSE)<>\"\",LoB!W17<=VLOOKUP(LoB!V17,List!$A$2:$E$101,2,FALSE)),\"Too Small\",IF(AND(VLOOKUP(LoB!V17,List!$A$2:$E$101,3,FALSE)<>\"\",LoB!W17>=VLOOKUP(LoB!V17,List!$A$2:$E$101,3,FALSE)),\"Too Large\",\"OK\"))))","v":""},{"$f":"IF(V17<>\"OK\",\"\",IF(AND(VLOOKUP(LoB!V17,List!$A$2:$E$101,4,FALSE)<>\"\",LoB!X17<=VLOOKUP(LoB!V17,List!$A$2:$E$101,4,FALSE)),\"Too Small\",IF(AND(VLOOKUP(LoB!V17,List!$A$2:$E$101,5,FALSE)<>\"\",LoB!X17>=VLOOKUP(LoB!V17,List!$A$2:$E$101,5,FALSE)),\"Too Large\",\"OK\")))","v":""},null,{"$f":"IF(V17<>\"OK\",\"\",IF(AND(LoB!Y17=\"Yes\",LoB!Z17>LoB!AA17),\"Min > Max\",IF(AND(LoB!Y17=\"Yes\",NOT(ISNUMBER(LoB!Z17))),\"Not Number\",\"OK\")))","v":""},{"$f":"IF(V17<>\"OK\",\"\",IF(AND(LoB!Y17=\"Yes\",LoB!Z17>LoB!AA17),\"Min > Max\",IF(AND(LoB!Y17=\"Yes\",NOT(ISNUMBER(LoB!AA17))),\"Not Number\",\"OK\")))","v":""},{"$f":"IF($E17<>\"Yes\",\"\",IF(OR(LoB!AB17=\"\",ISERROR(MATCH(LoB!AB17,Index!$B$1:$CW$1,0))),\"Not Available\",\"OK\"))","v":""},{"$f":"IF($E17<>\"Yes\",\"\",IF(OR(LoB!AC17=\"CLOSED\",LoB!AC17=\"ALL\"),\"OK\",\"Not Available\"))","v":""},{"$f":"IF($E17<>\"Yes\",\"\",IF(ISERROR(MATCH(LoB!AD17,List!$A$2:$A$101,0)),\"Not Available\",\"OK\"))","v":""},{"$f":"IF(AD17<>\"OK\",\"\",IF(LoB!AD17=\"Empirical\",IF(OR(LoB!AE17=\"\",ISERROR(MATCH(LoB!AE17,Empirical!$B$1:$CW$1,0))),\"Not Available\",\"OK\"),IF(AND(VLOOKUP(LoB!AD17,List!$A$2:$E$101,2,FALSE)<>\"\",LoB!AE17<=VLOOKUP(LoB!AD17,List!$A$2:$E$101,2,FALSE)),\"Too Small\",IF(AND(VLOOKUP(LoB!AD17,List!$A$2:$E$101,3,FALSE)<>\"\",LoB!AE17>=VLOOKUP(LoB!AD17,List!$A$2:$E$101,3,FALSE)),\"Too Large\",\"OK\"))))","v":""},{"$f":"IF(AD17<>\"OK\",\"\",IF(AND(VLOOKUP(LoB!AD17,List!$A$2:$E$101,4,FALSE)<>\"\",LoB!AF17<=VLOOKUP(LoB!AD17,List!$A$2:$E$101,4,FALSE)),\"Too Small\",IF(AND(VLOOKUP(LoB!AD17,List!$A$2:$E$101,5,FALSE)<>\"\",LoB!AF17>=VLOOKUP(LoB!AD17,List!$A$2:$E$101,5,FALSE)),\"Too Large\",\"OK\")))","v":""},null,{"$f":"IF(AD17<>\"OK\",\"\",IF(AND(LoB!AG17=\"Yes\",LoB!AH17>LoB!AI17),\"Min > Max\",IF(AND(LoB!AG17=\"Yes\",NOT(ISNUMBER(LoB!AH17))),\"Not Number\",\"OK\")))","v":""},{"$f":"IF(AD17<>\"OK\",\"\",IF(AND(LoB!AG17=\"Yes\",LoB!AH17>LoB!AI17),\"Min > Max\",IF(AND(LoB!AG17=\"Yes\",NOT(ISNUMBER(LoB!AI17))),\"Not Number\",\"OK\")))","v":""},{"$f":"IF($E17<>\"Yes\",\"\",IF(ISERROR(MATCH(LoB!AJ17,List!$A$2:$A$101,0)),\"Not Available\",\"OK\"))","v":""},{"$f":"IF(AJ17<>\"OK\",\"\",IF(LoB!AJ17=\"Empirical\",IF(OR(LoB!AK17=\"\",ISERROR(MATCH(LoB!AK17,Empirical!$B$1:$CW$1,0))),\"Not Available\",\"OK\"),IF(AND(VLOOKUP(LoB!AJ17,List!$A$2:$E$101,2,FALSE)<>\"\",LoB!AK17<=VLOOKUP(LoB!AJ17,List!$A$2:$E$101,2,FALSE)),\"Too Small\",IF(AND(VLOOKUP(LoB!AJ17,List!$A$2:$E$101,3,FALSE)<>\"\",LoB!AK17>=VLOOKUP(LoB!AJ17,List!$A$2:$E$101,3,FALSE)),\"Too Large\",\"OK\"))))","v":""},{"$f":"IF(AJ17<>\"OK\",\"\",IF(AND(VLOOKUP(LoB!AJ17,List!$A$2:$E$101,4,FALSE)<>\"\",LoB!AL17<=VLOOKUP(LoB!AJ17,List!$A$2:$E$101,4,FALSE)),\"Too Small\",IF(AND(VLOOKUP(LoB!AJ17,List!$A$2:$E$101,5,FALSE)<>\"\",LoB!AL17>=VLOOKUP(LoB!AJ17,List!$A$2:$E$101,5,FALSE)),\"Too Large\",\"OK\")))","v":""},null,{"$f":"IF(AJ17<>\"OK\",\"\",IF(AND(LoB!AM17=\"Yes\",LoB!AN17>LoB!AO17),\"Min > Max\",IF(AND(LoB!AM17=\"Yes\",NOT(ISNUMBER(LoB!AN17))),\"Not Number\",\"OK\")))","v":""},{"$f":"IF(AJ17<>\"OK\",\"\",IF(AND(LoB!AM17=\"Yes\",LoB!AN17>LoB!AO17),\"Min > Max\",IF(AND(LoB!AM17=\"Yes\",NOT(ISNUMBER(LoB!AO17))),\"Not Number\",\"OK\")))","v":""},{"$f":"IF($E17<>\"Yes\",\"\",IF(ISERROR(MATCH(LoB!AP17,List!$A$2:$A$101,0)),\"Not Available\",\"OK\"))","v":""},{"$f":"IF(AP17<>\"OK\",\"\",IF(LoB!AP17=\"Empirical\",IF(OR(LoB!AQ17=\"\",ISERROR(MATCH(LoB!AQ17,Empirical!$B$1:$CW$1,0))),\"Not Available\",\"OK\"),IF(AND(VLOOKUP(LoB!AP17,List!$A$2:$E$101,2,FALSE)<>\"\",LoB!AQ17<=VLOOKUP(LoB!AP17,List!$A$2:$E$101,2,FALSE)),\"Too Small\",IF(AND(VLOOKUP(LoB!AP17,List!$A$2:$E$101,3,FALSE)<>\"\",LoB!AQ17>=VLOOKUP(LoB!AP17,List!$A$2:$E$101,3,FALSE)),\"Too Large\",\"OK\"))))","v":""},{"$f":"IF(AP17<>\"OK\",\"\",IF(AND(VLOOKUP(LoB!AP17,List!$A$2:$E$101,4,FALSE)<>\"\",LoB!AR17<=VLOOKUP(LoB!AP17,List!$A$2:$E$101,4,FALSE)),\"Too Small\",IF(AND(VLOOKUP(LoB!AP17,List!$A$2:$E$101,5,FALSE)<>\"\",LoB!AR17>=VLOOKUP(LoB!AP17,List!$A$2:$E$101,5,FALSE)),\"Too Large\",\"OK\")))","v":""},null,{"$f":"IF(AP17<>\"OK\",\"\",IF(AND(LoB!AS17=\"Yes\",LoB!AT17>LoB!AU17),\"Min > Max\",IF(AND(LoB!AS17=\"Yes\",NOT(ISNUMBER(LoB!AT17))),\"Not Number\",\"OK\")))","v":""},{"$f":"IF(AP17<>\"OK\",\"\",IF(AND(LoB!AS17=\"Yes\",LoB!AT17>LoB!AU17),\"Min > Max\",IF(AND(LoB!AS17=\"Yes\",NOT(ISNUMBER(LoB!AU17))),\"Not Number\",\"OK\")))","v":""},{"$f":"IF($E17<>\"Yes\",\"\",IF(ISERROR(MATCH(LoB!AV17,List!$F$2:$F$101,0)),\"Not Available\",\"OK\"))","v":""},{"$f":"IF(AV17<>\"OK\",\"\",IF(LoB!AV17=\"Independent\",\"OK\",IF(OR(AND(LoB!AV17=\"clayton\",LoB!AW17<-1),AND(OR(LoB!AV17=\"gumbel\",LoB!AV17=\"joe\"),LoB!AW17<1),AND(LoB!AV17<>\"normal\",LoB!AV17<>\"t\",LoB!AW17=0)),\"Invalid Value\",IF(AND(OR(LoB!AV17=\"normal\",LoB!AV17=\"t\"),ABS(LoB!AW17)>1),\"|Correlation|>1\",IF(AND(OR(LoB!AV17=\"normal\",LoB!AV17=\"t\"),LoB!AW17=\"\"),\"No Value\",\"OK\")))))","v":""},{"$f":"IF(AV17<>\"OK\",\"\",IF(LoB!AV17=\"Independent\",\"OK\", IF(AND(OR(LoB!AV17=\"normal\",LoB!AV17=\"t\"),1-LoB!AW17*LoB!AX17<0),\"Non Positive Semidefinite\",IF(ABS(LoB!AX17)>1,\"|Correlation|>1\",IF(LoB!AX17=\"\",\"No Value\",\"OK\")))))","v":""},{"$f":"IF(AV17<>\"OK\",\"\",IF(AND(OR(LoB!AV17=\"normal\",LoB!AV17=\"t\"),detm(LoB!AW17,LoB!AX17,LoB!AY17)<0),\"Non Positive Semidefinite\",IF(ABS(LoB!AY17)>1,\"|Correlation >1\",IF(LoB!AY17=\"\",\"\",\"OK\"))))","v":""},{"$f":"IF(AV17<>\"OK\",\"\",IF(AND(LoB!AV17=\"t\",LoB!AZ17<=0),\"Wrong DoF\",\"OK\"))","v":""},{"$f":"IF($E17<>\"Yes\",\"\",IF(OR(LoB!BA17=\"\",AND(ISERROR(MATCH(LoB!BA17,FactorTable!$B$1:$GS$1,0)),ISERROR(MATCH(LoB!BA17,Function!$C$1:$CX$1,0)))),\"Not Available\",\"OK\"))","v":""},{"$f":"IF($E17<>\"Yes\",\"\",IF(OR(LoB!BB17=\"Empirical\",LoB!BB17=\"None\",LoB!BB17=\"Fixed\"),\"OK\",\"Wrong\"))","v":""},{"$f":"IF(BB17<>\"OK\",\"\",IF(LoB!BB17=\"Empirical\",IF(OR(LoB!BC17=\"\",ISERROR(MATCH(LoB!BC17,Empirical!$B$1:$CW$1,0))),\"Not Available\",\"OK\"),IF(AND(LoB!BB17=\"Fixed\",LoB!BC17>=0),\"OK\",\"OK\")))","v":""},{"$f":"IF($E17<>\"Yes\",\"\",IF(OR(LoB!BD17=\"Empirical\",LoB!BD17=\"None\",LoB!BB17=\"Fixed\"),\"OK\",\"Wrong\"))","v":""},{"$f":"IF(BD17<>\"OK\",\"\",IF(LoB!BD17=\"Empirical\",IF(OR(LoB!BE17=\"\",ISERROR(MATCH(LoB!BE17,Empirical!$B$1:$CW$1,0))),\"Not Available\",\"OK\"),IF(AND(LoB!BD17=\"Fixed\",LoB!BE17>=0),\"OK\",\"OK\")))","v":""},{"$f":"IF($E17<>\"Yes\",\"\",IF(OR(LoB!BF17=\"\",ISERROR(MATCH(LoB!BF17,List!$M$2:$M$28,0))),\"Not Available\",\"OK\"))","v":""}]
[null,"Correct",{"$f":"IF(LoB!C18=\"\",\"\",LoB!C18)","v":""},{"$f":"IF(LoB!D18=\"\",\"\",LoB!D18)","v":""},{"$f":"IF(LoB!E18=\"\",\"\",LoB!E18)","v":""},{"$f":"IF($E18<>\"Yes\",\"\",IF(OR(LoB!F18=\"CondPaid\",LoB!F18=\"CondIncurLoss\"),\"OK\",IF(OR(AND(ISERROR(MATCH(LoB!F18,FactorTable!$B$1:$GS$1,0)),ISERROR(MATCH(LoB!F18,Function!$C$1:$CX$1,0)))),\"Not Available\",\"OK\")))","v":""},{"$f":"IF($E18<>\"Yes\",\"\",IF(OR(LoB!G18=\"\",AND(ISERROR(MATCH(LoB!G18,FactorTable!$B$1:$GS$1,0)),ISERROR(MATCH(LoB!G18,Function!$C$1:$CX$1,0)))),\"Not Available\",\"OK\"))","v":""},{"$f":"IF($E18<>\"Yes\",\"\",IF(OR(LoB!H18=\"CondPaid\",LoB!H18=\"CondIncurLoss\"),\"OK\",IF(OR(AND(ISERROR(MATCH(LoB!H18,FactorTable!$B$1:$GS$1,0)),ISERROR(MATCH(LoB!H18,Function!$C$1:$CX$1,0)))),\"Not Available\",\"OK\")))","v":""},{"$f":"IF($E18<>\"Yes\",\"\",IF(ISERROR(MATCH(LoB!I18,List!$A$2:$A$101,0)),\"Not Available\",\"OK\"))","v":""},{"$f":"IF(I18<>\"OK\",\"\",IF(LoB!I18=\"Empirical\",IF(OR(LoB!J18=\"\",ISERROR(MATCH(LoB!J18,Empirical!$B$1:$CW$1,0))),\"Not Available\",\"OK\"),IF(AND(VLOOKUP(LoB!I18,List!$A$2:$E$101,2,FALSE)<>\"\",LoB!J18<=VLOOKUP(LoB!I18,List!$A$2:$E$101,2,FALSE)),\"Too Small\",IF(AND(VLOOKUP(LoB!I18,List!$A$2:$E$101,3,FALSE)<>\"\",LoB!J18>=VLOOKUP(LoB!I18,List!$A$2:$E$101,3,FALSE)),\"Too Large\",\"OK\"))))","v":""},{"$f":"IF(I18<>\"OK\",\"\",IF(AND(VLOOKUP(LoB!I18,List!$A$2:$E$101,4,FALSE)<>\"\",LoB!K18<=VLOOKUP(LoB!I18,List!$A$2:$E$101,4,FALSE)),\"Too Small\",IF(AND(VLOOKUP(LoB!I18,List!$A$2:$E$101,5,FALSE)<>\"\",LoB!K18>=VLOOKUP(LoB!I18,List!$A$2:$E$101,5,FALSE)),\"Too Large\",\"OK\")))","v":""},null,{"$f":"IF(I18<>\"OK\",\"\",IF(AND(LoB!L18=\"Yes\",LoB!M18>LoB!N18),\"Min > Max\",IF(AND(LoB!L18=\"Yes\",NOT(ISNUMBER(LoB!M18))),\"Not Number\",\"OK\")))","v":""},{"$f":"IF(I18<>\"OK\",\"\",IF(AND(LoB!L18=\"Yes\",LoB!M18>LoB!N18),\"Min > Max\",IF(AND(LoB!L18=\"Yes\",NOT(ISNUMBER(LoB!N18))),\"Not Number\",\"OK\")))","v":""},{"$f":"IF($E18<>\"Yes\",\"\",IF(ISERROR(MATCH(LoB!O18,List!$A$2:$A$101,0)),\"Not Available\",\"OK\"))","v":""},{"$f":"IF(O18<>\"OK\",\"\",IF(LoB!O18=\"Empirical\",IF(OR(LoB!P18=\"\",ISERROR(MATCH(LoB!P18,Empirical!$B$1:$CW$1,0))),\"Not Available\",\"OK\"),IF(AND(VLOOKUP(LoB!O18,List!$A$2:$E$101,2,FALSE)<>\"\",LoB!P18<=VLOOKUP(LoB!O18,List!$A$2:$E$101,2,FALSE)),\"Too Small\",IF(AND(VLOOKUP(LoB!O18,List!$A$2:$E$101,3,FALSE)<>\"\",LoB!P18>=VLOOKUP(LoB!O18,List!$A$2:$E$101,3,FALSE)),\"Too Large\",\"OK\"))))","v":""},{"$f":"IF(O18<>\"OK\",\"\",IF(AND(VLOOKUP(LoB!O18,List!$A$2:$E$101,4,FALSE)<>\"\",LoB!Q18<=VLOOKUP(LoB!O18,List!$A$2:$E$101,4,FALSE)),\"Too Small\",IF(AND(VLOOKUP(LoB!O18,List!$A$2:$E$101,5,FALSE)<>\"\",LoB!Q18>=VLOOKUP(LoB!O18,List!$A$2:$E$101,5,FALSE)),\"Too Large\",\"OK\")))","v":""},null,{"$f":"IF(O18<>\"OK\",\"\",IF(AND(LoB!R18=\"Yes\",LoB!S18>LoB!T18),\"Min > Max\",IF(AND(LoB!R18=\"Yes\",NOT(ISNUMBER(LoB!S18))),\"Not Number\",\"OK\")))","v":""},{"$f":"IF(O18<>\"OK\",\"\",IF(AND(LoB!R18=\"Yes\",LoB!S18>LoB!T18),\"Min > Max\",IF(AND(LoB!R18=\"Yes\",NOT(ISNUMBER(LoB!T18))),\"Not Number\",\"OK\")))","v":""},{"$f":"IF($E18<>\"Yes\",\"\",IF(OR(LoB!U18=\"\",ISERROR(MATCH(LoB!U18,Index!$B$1:$CW$1,0))),\"Not Available\",\"OK\"))","v":""},{"$f":"IF($E18<>\"Yes\",\"\",IF(ISERROR(MATCH(LoB!V18,List!$A$2:$A$101,0)),\"Not Available\",\"OK\"))","v":""},{"$f":"IF(V18<>\"OK\",\"\",IF(LoB!V18=\"Empirical\",IF(OR(LoB!W18=\"\",ISERROR(MATCH(LoB!W18,Empirical!$B$1:$CW$1,0))),\"Not Available\",\"OK\"),IF(AND(VLOOKUP(LoB!V18,List!$A$2:$E$101,2,FALSE)<>\"\",LoB!W18<=VLOOKUP(LoB!V18,List!$A$2:$E$101,2,FALSE)),\"Too Small\",IF(AND(VLOOKUP(LoB!V18,List!$A$2:$E$101,3,FALSE)<>\"\",LoB!W18>=VLOOKUP(LoB!V18,List!$A$2:$E$101,3,FALSE)),\"Too Large\",\"OK\"))))","v":""},{"$f":"IF(V18<>\"OK\",\"\",IF(AND(VLOOKUP(LoB!V18,List!$A$2:$E$101,4,FALSE)<>\"\",LoB!X18<=VLOOKUP(LoB!V18,List!$A$2:$E$101,4,FALSE)),\"Too Small\",IF(AND(VLOOKUP(LoB!V18,List!$A$2:$E$101,5,FALSE)<>\"\",LoB!X18>=VLOOKUP(LoB!V18,List!$A$2:$E$101,5,FALSE)),\"Too Large\",\"OK\")))","v":""},null,{"$f":"IF(V18<>\"OK\",\"\",IF(AND(LoB!Y18=\"Yes\",LoB!Z18>LoB!AA18),\"Min > Max\",IF(AND(LoB!Y18=\"Yes\",NOT(ISNUMBER(LoB!Z18))),\"Not Number\",\"OK\")))","v":""},{"$f":"IF(V18<>\"OK\",\"\",IF(AND(LoB!Y18=\"Yes\",LoB!Z18>LoB!AA18),\"Min > Max\",IF(AND(LoB!Y18=\"Yes\",NOT(ISNUMBER(LoB!AA18))),\"Not Number\",\"OK\")))","v":""},{"$f":"IF($E18<>\"Yes\",\"\",IF(OR(LoB!AB18=\"\",ISERROR(MATCH(LoB!AB18,Index!$B$1:$CW$1,0))),\"Not Available\",\"OK\"))","v":""},{"$f":"IF($E18<>\"Yes\",\"\",IF(OR(LoB!AC18=\"CLOSED\",LoB!AC18=\"ALL\"),\"OK\",\"Not Available\"))","v":""},{"$f":"IF($E18<>\"Yes\",\"\",IF(ISERROR(MATCH(LoB!AD18,List!$A$2:$A$101,0)),\"Not Available\",\"OK\"))","v":""},{"$f":"IF(AD18<>\"OK\",\"\",IF(LoB!AD18=\"Empirical\",IF(OR(LoB!AE18=\"\",ISERROR(MATCH(LoB!AE18,Empirical!$B$1:$CW$1,0))),\"Not Available\",\"OK\"),IF(AND(VLOOKUP(LoB!AD18,List!$A$2:$E$101,2,FALSE)<>\"\",LoB!AE18<=VLOOKUP(LoB!AD18,List!$A$2:$E$101,2,FALSE)),\"Too Small\",IF(AND(VLOOKUP(LoB!AD18,List!$A$2:$E$101,3,FALSE)<>\"\",LoB!AE18>=VLOOKUP(LoB!AD18,List!$A$2:$E$101,3,FALSE)),\"Too Large\",\"OK\"))))","v":""},{"$f":"IF(AD18<>\"OK\",\"\",IF(AND(VLOOKUP(LoB!AD18,List!$A$2:$E$101,4,FALSE)<>\"\",LoB!AF18<=VLOOKUP(LoB!AD18,List!$A$2:$E$101,4,FALSE)),\"Too Small\",IF(AND(VLOOKUP(LoB!AD18,List!$A$2:$E$101,5,FALSE)<>\"\",LoB!AF18>=VLOOKUP(LoB!AD18,List!$A$2:$E$101,5,FALSE)),\"Too Large\",\"OK\")))","v":""},null,{"$f":"IF(AD18<>\"OK\",\"\",IF(AND(LoB!AG18=\"Yes\",LoB!AH18>LoB!AI18),\"Min > Max\",IF(AND(LoB!AG18=\"Yes\",NOT(ISNUMBER(LoB!AH18))),\"Not Number\",\"OK\")))","v":""},{"$f":"IF(AD18<>\"OK\",\"\",IF(AND(LoB!AG18=\"Yes\",LoB!AH18>LoB!AI18),\"Min > Max\",IF(AND(LoB!AG18=\"Yes\",NOT(ISNUMBER(LoB!AI18))),\"Not Number\",\"OK\")))","v":""},{"$f":"IF($E18<>\"Yes\",\"\",IF(ISERROR(MATCH(LoB!AJ18,List!$A$2:$A$101,0)),\"Not Available\",\"OK\"))","v":""},{"$f":"IF(AJ18<>\"OK\",\"\",IF(LoB!AJ18=\"Empirical\",IF(OR(LoB!AK18=\"\",ISERROR(MATCH(LoB!AK18,Empirical!$B$1:$CW$1,0))),\"Not Available\",\"OK\"),IF(AND(VLOOKUP(LoB!AJ18,List!$A$2:$E$101,2,FALSE)<>\"\",LoB!AK18<=VLOOKUP(LoB!AJ18,List!$A$2:$E$101,2,FALSE)),\"Too Small\",IF(AND(VLOOKUP(LoB!AJ18,List!$A$2:$E$101,3,FALSE)<>\"\",LoB!AK18>=VLOOKUP(LoB!AJ18,List!$A$2:$E$101,3,FALSE)),\"Too Large\",\"OK\"))))","v":""},{"$f":"IF(AJ18<>\"OK\",\"\",IF(AND(VLOOKUP(LoB!AJ18,List!$A$2:$E$101,4,FALSE)<>\"\",LoB!AL18<=VLOOKUP(LoB!AJ18,List!$A$2:$E$101,4,FALSE)),\"Too Small\",IF(AND(VLOOKUP(LoB!AJ18,List!$A$2:$E$101,5,FALSE)<>\"\",LoB!AL18>=VLOOKUP(LoB!AJ18,List!$A$2:$E$101,5,FALSE)),\"Too Large\",\"OK\")))","v":""},null,{"$f":"IF(AJ18<>\"OK\",\"\",IF(AND(LoB!AM18=\"Yes\",LoB!AN18>LoB!AO18),\"Min > Max\",IF(AND(LoB!AM18=\"Yes\",NOT(ISNUMBER(LoB!AN18))),\"Not Number\",\"OK\")))","v":""},{"$f":"IF(AJ18<>\"OK\",\"\",IF(AND(LoB!AM18=\"Yes\",LoB!AN18>LoB!AO18),\"Min > Max\",IF(AND(LoB!AM18=\"Yes\",NOT(ISNUMBER(LoB!AO18))),\"Not Number\",\"OK\")))","v":""},{"$f":"IF($E18<>\"Yes\",\"\",IF(ISERROR(MATCH(LoB!AP18,List!$A$2:$A$101,0)),\"Not Available\",\"OK\"))","v":""},{"$f":"IF(AP18<>\"OK\",\"\",IF(LoB!AP18=\"Empirical\",IF(OR(LoB!AQ18=\"\",ISERROR(MATCH(LoB!AQ18,Empirical!$B$1:$CW$1,0))),\"Not Available\",\"OK\"),IF(AND(VLOOKUP(LoB!AP18,List!$A$2:$E$101,2,FALSE)<>\"\",LoB!AQ18<=VLOOKUP(LoB!AP18,List!$A$2:$E$101,2,FALSE)),\"Too Small\",IF(AND(VLOOKUP(LoB!AP18,List!$A$2:$E$101,3,FALSE)<>\"\",LoB!AQ18>=VLOOKUP(LoB!AP18,List!$A$2:$E$101,3,FALSE)),\"Too Large\",\"OK\"))))","v":""},{"$f":"IF(AP18<>\"OK\",\"\",IF(AND(VLOOKUP(LoB!AP18,List!$A$2:$E$101,4,FALSE)<>\"\",LoB!AR18<=VLOOKUP(LoB!AP18,List!$A$2:$E$101,4,FALSE)),\"Too Small\",IF(AND(VLOOKUP(LoB!AP18,List!$A$2:$E$101,5,FALSE)<>\"\",LoB!AR18>=VLOOKUP(LoB!AP18,List!$A$2:$E$101,5,FALSE)),\"Too Large\",\"OK\")))","v":""},null,{"$f":"IF(AP18<>\"OK\",\"\",IF(AND(LoB!AS18=\"Yes\",LoB!AT18>LoB!AU18),\"Min > Max\",IF(AND(LoB!AS18=\"Yes\",NOT(ISNUMBER(LoB!AT18))),\"Not Number\",\"OK\")))","v":""},{"$f":"IF(AP18<>\"OK\",\"\",IF(AND(LoB!AS18=\"Yes\",LoB!AT18>LoB!AU18),\"Min > Max\",IF(AND(LoB!AS18=\"Yes\",NOT(ISNUMBER(LoB!AU18))),\"Not Number\",\"OK\")))","v":""},{"$f":"IF($E18<>\"Yes\",\"\",IF(ISERROR(MATCH(LoB!AV18,List!$F$2:$F$101,0)),\"Not Available\",\"OK\"))","v":""},{"$f":"IF(AV18<>\"OK\",\"\",IF(LoB!AV18=\"Independent\",\"OK\",IF(OR(AND(LoB!AV18=\"clayton\",LoB!AW18<-1),AND(OR(LoB!AV18=\"gumbel\",LoB!AV18=\"joe\"),LoB!AW18<1),AND(LoB!AV18<>\"normal\",LoB!AV18<>\"t\",LoB!AW18=0)),\"Invalid Value\",IF(AND(OR(LoB!AV18=\"normal\",LoB!AV18=\"t\"),ABS(LoB!AW18)>1),\"|Correlation|>1\",IF(AND(OR(LoB!AV18=\"normal\",LoB!AV18=\"t\"),LoB!AW18=\"\"),\"No Value\",\"OK\")))))","v":""},{"$f":"IF(AV18<>\"OK\",\"\",IF(LoB!AV18=\"Independent\",\"OK\", IF(AND(OR(LoB!AV18=\"normal\",LoB!AV18=\"t\"),1-LoB!AW18*LoB!AX18<0),\"Non Positive Semidefinite\",IF(ABS(LoB!AX18)>1,\"|Correlation|>1\",IF(LoB!AX18=\"\",\"No Value\",\"OK\")))))","v":""},{"$f":"IF(AV18<>\"OK\",\"\",IF(AND(OR(LoB!AV18=\"normal\",LoB!AV18=\"t\"),detm(LoB!AW18,LoB!AX18,LoB!AY18)<0),\"Non Positive Semidefinite\",IF(ABS(LoB!AY18)>1,\"|Correlation >1\",IF(LoB!AY18=\"\",\"\",\"OK\"))))","v":""},{"$f":"IF(AV18<>\"OK\",\"\",IF(AND(LoB!AV18=\"t\",LoB!AZ18<=0),\"Wrong DoF\",\"OK\"))","v":""},{"$f":"IF($E18<>\"Yes\",\"\",IF(OR(LoB!BA18=\"\",AND(ISERROR(MATCH(LoB!BA18,FactorTable!$B$1:$GS$1,0)),ISERROR(MATCH(LoB!BA18,Function!$C$1:$CX$1,0)))),\"Not Available\",\"OK\"))","v":""},{"$f":"IF($E18<>\"Yes\",\"\",IF(OR(LoB!BB18=\"Empirical\",LoB!BB18=\"None\",LoB!BB18=\"Fixed\"),\"OK\",\"Wrong\"))","v":""},{"$f":"IF(BB18<>\"OK\",\"\",IF(LoB!BB18=\"Empirical\",IF(OR(LoB!BC18=\"\",ISERROR(MATCH(LoB!BC18,Empirical!$B$1:$CW$1,0))),\"Not Available\",\"OK\"),IF(AND(LoB!BB18=\"Fixed\",LoB!BC18>=0),\"OK\",\"OK\")))","v":""},{"$f":"IF($E18<>\"Yes\",\"\",IF(OR(LoB!BD18=\"Empirical\",LoB!BD18=\"None\",LoB!BB18=\"Fixed\"),\"OK\",\"Wrong\"))","v":""},{"$f":"IF(BD18<>\"OK\",\"\",IF(LoB!BD18=\"Empirical\",IF(OR(LoB!BE18=\"\",ISERROR(MATCH(LoB!BE18,Empirical!$B$1:$CW$1,0))),\"Not Available\",\"OK\"),IF(AND(LoB!BD18=\"Fixed\",LoB!BE18>=0),\"OK\",\"OK\")))","v":""},{"$f":"IF($E18<>\"Yes\",\"\",IF(OR(LoB!BF18=\"\",ISERROR(MATCH(LoB!BF18,List!$M$2:$M$28,0))),\"Not Available\",\"OK\"))","v":""}]
[null,"Correct",{"$f":"IF(LoB!C19=\"\",\"\",LoB!C19)","v":""},{"$f":"IF(LoB!D19=\"\",\"\",LoB!D19)","v":""},{"$f":"IF(LoB!E19=\"\",\"\",LoB!E19)","v":""},{"$f":"IF($E19<>\"Yes\",\"\",IF(OR(LoB!F19=\"CondPaid\",LoB!F19=\"CondIncurLoss\"),\"OK\",IF(OR(AND(ISERROR(MATCH(LoB!F19,FactorTable!$B$1:$GS$1,0)),ISERROR(MATCH(LoB!F19,Function!$C$1:$CX$1,0)))),\"Not Available\",\"OK\")))","v":""},{"$f":"IF($E19<>\"Yes\",\"\",IF(OR(LoB!G19=\"\",AND(ISERROR(MATCH(LoB!G19,FactorTable!$B$1:$GS$1,0)),ISERROR(MATCH(LoB!G19,Function!$C$1:$CX$1,0)))),\"Not Available\",\"OK\"))","v":""},{"$f":"IF($E19<>\"Yes\",\"\",IF(OR(LoB!H19=\"CondPaid\",LoB!H19=\"CondIncurLoss\"),\"OK\",IF(OR(AND(ISERROR(MATCH(LoB!H19,FactorTable!$B$1:$GS$1,0)),ISERROR(MATCH(LoB!H19,Function!$C$1:$CX$1,0)))),\"Not Available\",\"OK\")))","v":""},{"$f":"IF($E19<>\"Yes\",\"\",IF(ISERROR(MATCH(LoB!I19,List!$A$2:$A$101,0)),\"Not Available\",\"OK\"))","v":""},{"$f":"IF(I19<>\"OK\",\"\",IF(LoB!I19=\"Empirical\",IF(OR(LoB!J19=\"\",ISERROR(MATCH(LoB!J19,Empirical!$B$1:$CW$1,0))),\"Not Available\",\"OK\"),IF(AND(VLOOKUP(LoB!I19,List!$A$2:$E$101,2,FALSE)<>\"\",LoB!J19<=VLOOKUP(LoB!I19,List!$A$2:$E$101,2,FALSE)),\"Too Small\",IF(AND(VLOOKUP(LoB!I19,List!$A$2:$E$101,3,FALSE)<>\"\",LoB!J19>=VLOOKUP(LoB!I19,List!$A$2:$E$101,3,FALSE)),\"Too Large\",\"OK\"))))","v":""},{"$f":"IF(I19<>\"OK\",\"\",IF(AND(VLOOKUP(LoB!I19,List!$A$2:$E$101,4,FALSE)<>\"\",LoB!K19<=VLOOKUP(LoB!I19,List!$A$2:$E$101,4,FALSE)),\"Too Small\",IF(AND(VLOOKUP(LoB!I19,List!$A$2:$E$101,5,FALSE)<>\"\",LoB!K19>=VLOOKUP(LoB!I19,List!$A$2:$E$101,5,FALSE)),\"Too Large\",\"OK\")))","v":""},null,{"$f":"IF(I19<>\"OK\",\"\",IF(AND(LoB!L19=\"Yes\",LoB!M19>LoB!N19),\"Min > Max\",IF(AND(LoB!L19=\"Yes\",NOT(ISNUMBER(LoB!M19))),\"Not Number\",\"OK\")))","v":""},{"$f":"IF(I19<>\"OK\",\"\",IF(AND(LoB!L19=\"Yes\",LoB!M19>LoB!N19),\"Min > Max\",IF(AND(LoB!L19=\"Yes\",NOT(ISNUMBER(LoB!N19))),\"Not Number\",\"OK\")))","v":""},{"$f":"IF($E19<>\"Yes\",\"\",IF(ISERROR(MATCH(LoB!O19,List!$A$2:$A$101,0)),\"Not Available\",\"OK\"))","v":""},{"$f":"IF(O19<>\"OK\",\"\",IF(LoB!O19=\"Empirical\",IF(OR(LoB!P19=\"\",ISERROR(MATCH(LoB!P19,Empirical!$B$1:$CW$1,0))),\"Not Available\",\"OK\"),IF(AND(VLOOKUP(LoB!O19,List!$A$2:$E$101,2,FALSE)<>\"\",LoB!P19<=VLOOKUP(LoB!O19,List!$A$2:$E$101,2,FALSE)),\"Too Small\",IF(AND(VLOOKUP(LoB!O19,List!$A$2:$E$101,3,FALSE)<>\"\",LoB!P19>=VLOOKUP(LoB!O19,List!$A$2:$E$101,3,FALSE)),\"Too Large\",\"OK\"))))","v":""},{"$f":"IF(O19<>\"OK\",\"\",IF(AND(VLOOKUP(LoB!O19,List!$A$2:$E$101,4,FALSE)<>\"\",LoB!Q19<=VLOOKUP(LoB!O19,List!$A$2:$E$101,4,FALSE)),\"Too Small\",IF(AND(VLOOKUP(LoB!O19,List!$A$2:$E$101,5,FALSE)<>\"\",LoB!Q19>=VLOOKUP(LoB!O19,List!$A$2:$E$101,5,FALSE)),\"Too Large\",\"OK\")))","v":""},null,{"$f":"IF(O19<>\"OK\",\"\",IF(AND(LoB!R19=\"Yes\",LoB!S19>LoB!T19),\"Min > Max\",IF(AND(LoB!R19=\"Yes\",NOT(ISNUMBER(LoB!S19))),\"Not Number\",\"OK\")))","v":""},{"$f":"IF(O19<>\"OK\",\"\",IF(AND(LoB!R19=\"Yes\",LoB!S19>LoB!T19),\"Min > Max\",IF(AND(LoB!R19=\"Yes\",NOT(ISNUMBER(LoB!T19))),\"Not Number\",\"OK\")))","v":""},{"$f":"IF($E19<>\"Yes\",\"\",IF(OR(LoB!U19=\"\",ISERROR(MATCH(LoB!U19,Index!$B$1:$CW$1,0))),\"Not Available\",\"OK\"))","v":""},{"$f":"IF($E19<>\"Yes\",\"\",IF(ISERROR(MATCH(LoB!V19,List!$A$2:$A$101,0)),\"Not Available\",\"OK\"))","v":""},{"$f":"IF(V19<>\"OK\",\"\",IF(LoB!V19=\"Empirical\",IF(OR(LoB!W19=\"\",ISERROR(MATCH(LoB!W19,Empirical!$B$1:$CW$1,0))),\"Not Available\",\"OK\"),IF(AND(VLOOKUP(LoB!V19,List!$A$2:$E$101,2,FALSE)<>\"\",LoB!W19<=VLOOKUP(LoB!V19,List!$A$2:$E$101,2,FALSE)),\"Too Small\",IF(AND(VLOOKUP(LoB!V19,List!$A$2:$E$101,3,FALSE)<>\"\",LoB!W19>=VLOOKUP(LoB!V19,List!$A$2:$E$101,3,FALSE)),\"Too Large\",\"OK\"))))","v":""},{"$f":"IF(V19<>\"OK\",\"\",IF(AND(VLOOKUP(LoB!V19,List!$A$2:$E$101,4,FALSE)<>\"\",LoB!X19<=VLOOKUP(LoB!V19,List!$A$2:$E$101,4,FALSE)),\"Too Small\",IF(AND(VLOOKUP(LoB!V19,List!$A$2:$E$101,5,FALSE)<>\"\",LoB!X19>=VLOOKUP(LoB!V19,List!$A$2:$E$101,5,FALSE)),\"Too Large\",\"OK\")))","v":""},null,{"$f":"IF(V19<>\"OK\",\"\",IF(AND(LoB!Y19=\"Yes\",LoB!Z19>LoB!AA19),\"Min > Max\",IF(AND(LoB!Y19=\"Yes\",NOT(ISNUMBER(LoB!Z19))),\"Not Number\",\"OK\")))","v":""},{"$f":"IF(V19<>\"OK\",\"\",IF(AND(LoB!Y19=\"Yes\",LoB!Z19>LoB!AA19),\"Min > Max\",IF(AND(LoB!Y19=\"Yes\",NOT(ISNUMBER(LoB!AA19))),\"Not Number\",\"OK\")))","v":""},{"$f":"IF($E19<>\"Yes\",\"\",IF(OR(LoB!AB19=\"\",ISERROR(MATCH(LoB!AB19,Index!$B$1:$CW$1,0))),\"Not Available\",\"OK\"))","v":""},{"$f":"IF($E19<>\"Yes\",\"\",IF(OR(LoB!AC19=\"CLOSED\",LoB!AC19=\"ALL\"),\"OK\",\"Not Available\"))","v":""},{"$f":"IF($E19<>\"Yes\",\"\",IF(ISERROR(MATCH(LoB!AD19,List!$A$2:$A$101,0)),\"Not Available\",\"OK\"))","v":""},{"$f":"IF(AD19<>\"OK\",\"\",IF(LoB!AD19=\"Empirical\",IF(OR(LoB!AE19=\"\",ISERROR(MATCH(LoB!AE19,Empirical!$B$1:$CW$1,0))),\"Not Available\",\"OK\"),IF(AND(VLOOKUP(LoB!AD19,List!$A$2:$E$101,2,FALSE)<>\"\",LoB!AE19<=VLOOKUP(LoB!AD19,List!$A$2:$E$101,2,FALSE)),\"Too Small\",IF(AND(VLOOKUP(LoB!AD19,List!$A$2:$E$101,3,FALSE)<>\"\",LoB!AE19>=VLOOKUP(LoB!AD19,List!$A$2:$E$101,3,FALSE)),\"Too Large\",\"OK\"))))","v":""},{"$f":"IF(AD19<>\"OK\",\"\",IF(AND(VLOOKUP(LoB!AD19,List!$A$2:$E$101,4,FALSE)<>\"\",LoB!AF19<=VLOOKUP(LoB!AD19,List!$A$2:$E$101,4,FALSE)),\"Too Small\",IF(AND(VLOOKUP(LoB!AD19,List!$A$2:$E$101,5,FALSE)<>\"\",LoB!AF19>=VLOOKUP(LoB!AD19,List!$A$2:$E$101,5,FALSE)),\"Too Large\",\"OK\")))","v":""},null,{"$f":"IF(AD19<>\"OK\",\"\",IF(AND(LoB!AG19=\"Yes\",LoB!AH19>LoB!AI19),\"Min > Max\",IF(AND(LoB!AG19=\"Yes\",NOT(ISNUMBER(LoB!AH19))),\"Not Number\",\"OK\")))","v":""},{"$f":"IF(AD19<>\"OK\",\"\",IF(AND(LoB!AG19=\"Yes\",LoB!AH19>LoB!AI19),\"Min > Max\",IF(AND(LoB!AG19=\"Yes\",NOT(ISNUMBER(LoB!AI19))),\"Not Number\",\"OK\")))","v":""},{"$f":"IF($E19<>\"Yes\",\"\",IF(ISERROR(MATCH(LoB!AJ19,List!$A$2:$A$101,0)),\"Not Available\",\"OK\"))","v":""},{"$f":"IF(AJ19<>\"OK\",\"\",IF(LoB!AJ19=\"Empirical\",IF(OR(LoB!AK19=\"\",ISERROR(MATCH(LoB!AK19,Empirical!$B$1:$CW$1,0))),\"Not Available\",\"OK\"),IF(AND(VLOOKUP(LoB!AJ19,List!$A$2:$E$101,2,FALSE)<>\"\",LoB!AK19<=VLOOKUP(LoB!AJ19,List!$A$2:$E$101,2,FALSE)),\"Too Small\",IF(AND(VLOOKUP(LoB!AJ19,List!$A$2:$E$101,3,FALSE)<>\"\",LoB!AK19>=VLOOKUP(LoB!AJ19,List!$A$2:$E$101,3,FALSE)),\"Too Large\",\"OK\"))))","v":""},{"$f":"IF(AJ19<>\"OK\",\"\",IF(AND(VLOOKUP(LoB!AJ19,List!$A$2:$E$101,4,FALSE)<>\"\",LoB!AL19<=VLOOKUP(LoB!AJ19,List!$A$2:$E$101,4,FALSE)),\"Too Small\",IF(AND(VLOOKUP(LoB!AJ19,List!$A$2:$E$101,5,FALSE)<>\"\",LoB!AL19>=VLOOKUP(LoB!AJ19,List!$A$2:$E$101,5,FALSE)),\"Too Large\",\"OK\")))","v":""},null,{"$f":"IF(AJ19<>\"OK\",\"\",IF(AND(LoB!AM19=\"Yes\",LoB!AN19>LoB!AO19),\"Min > Max\",IF(AND(LoB!AM19=\"Yes\",NOT(ISNUMBER(LoB!AN19))),\"Not Number\",\"OK\")))","v":""},{"$f":"IF(AJ19<>\"OK\",\"\",IF(AND(LoB!AM19=\"Yes\",LoB!AN19>LoB!AO19),\"Min > Max\",IF(AND(LoB!AM19=\"Yes\",NOT(ISNUMBER(LoB!AO19))),\"Not Number\",\"OK\")))","v":""},{"$f":"IF($E19<>\"Yes\",\"\",IF(ISERROR(MATCH(LoB!AP19,List!$A$2:$A$101,0)),\"Not Available\",\"OK\"))","v":""},{"$f":"IF(AP19<>\"OK\",\"\",IF(LoB!AP19=\"Empirical\",IF(OR(LoB!AQ19=\"\",ISERROR(MATCH(LoB!AQ19,Empirical!$B$1:$CW$1,0))),\"Not Available\",\"OK\"),IF(AND(VLOOKUP(LoB!AP19,List!$A$2:$E$101,2,FALSE)<>\"\",LoB!AQ19<=VLOOKUP(LoB!AP19,List!$A$2:$E$101,2,FALSE)),\"Too Small\",IF(AND(VLOOKUP(LoB!AP19,List!$A$2:$E$101,3,FALSE)<>\"\",LoB!AQ19>=VLOOKUP(LoB!AP19,List!$A$2:$E$101,3,FALSE)),\"Too Large\",\"OK\"))))","v":""},{"$f":"IF(AP19<>\"OK\",\"\",IF(AND(VLOOKUP(LoB!AP19,List!$A$2:$E$101,4,FALSE)<>\"\",LoB!AR19<=VLOOKUP(LoB!AP19,List!$A$2:$E$101,4,FALSE)),\"Too Small\",IF(AND(VLOOKUP(LoB!AP19,List!$A$2:$E$101,5,FALSE)<>\"\",LoB!AR19>=VLOOKUP(LoB!AP19,List!$A$2:$E$101,5,FALSE)),\"Too Large\",\"OK\")))","v":""},null,{"$f":"IF(AP19<>\"OK\",\"\",IF(AND(LoB!AS19=\"Yes\",LoB!AT19>LoB!AU19),\"Min > Max\",IF(AND(LoB!AS19=\"Yes\",NOT(ISNUMBER(LoB!AT19))),\"Not Number\",\"OK\")))","v":""},{"$f":"IF(AP19<>\"OK\",\"\",IF(AND(LoB!AS19=\"Yes\",LoB!AT19>LoB!AU19),\"Min > Max\",IF(AND(LoB!AS19=\"Yes\",NOT(ISNUMBER(LoB!AU19))),\"Not Number\",\"OK\")))","v":""},{"$f":"IF($E19<>\"Yes\",\"\",IF(ISERROR(MATCH(LoB!AV19,List!$F$2:$F$101,0)),\"Not Available\",\"OK\"))","v":""},{"$f":"IF(AV19<>\"OK\",\"\",IF(LoB!AV19=\"Independent\",\"OK\",IF(OR(AND(LoB!AV19=\"clayton\",LoB!AW19<-1),AND(OR(LoB!AV19=\"gumbel\",LoB!AV19=\"joe\"),LoB!AW19<1),AND(LoB!AV19<>\"normal\",LoB!AV19<>\"t\",LoB!AW19=0)),\"Invalid Value\",IF(AND(OR(LoB!AV19=\"normal\",LoB!AV19=\"t\"),ABS(LoB!AW19)>1),\"|Correlation|>1\",IF(AND(OR(LoB!AV19=\"normal\",LoB!AV19=\"t\"),LoB!AW19=\"\"),\"No Value\",\"OK\")))))","v":""},{"$f":"IF(AV19<>\"OK\",\"\",IF(LoB!AV19=\"Independent\",\"OK\", IF(AND(OR(LoB!AV19=\"normal\",LoB!AV19=\"t\"),1-LoB!AW19*LoB!AX19<0),\"Non Positive Semidefinite\",IF(ABS(LoB!AX19)>1,\"|Correlation|>1\",IF(LoB!AX19=\"\",\"No Value\",\"OK\")))))","v":""},{"$f":"IF(AV19<>\"OK\",\"\",IF(AND(OR(LoB!AV19=\"normal\",LoB!AV19=\"t\"),detm(LoB!AW19,LoB!AX19,LoB!AY19)<0),\"Non Positive Semidefinite\",IF(ABS(LoB!AY19)>1,\"|Correlation >1\",IF(LoB!AY19=\"\",\"\",\"OK\"))))","v":""},{"$f":"IF(AV19<>\"OK\",\"\",IF(AND(LoB!AV19=\"t\",LoB!AZ19<=0),\"Wrong DoF\",\"OK\"))","v":""},{"$f":"IF($E19<>\"Yes\",\"\",IF(OR(LoB!BA19=\"\",AND(ISERROR(MATCH(LoB!BA19,FactorTable!$B$1:$GS$1,0)),ISERROR(MATCH(LoB!BA19,Function!$C$1:$CX$1,0)))),\"Not Available\",\"OK\"))","v":""},{"$f":"IF($E19<>\"Yes\",\"\",IF(OR(LoB!BB19=\"Empirical\",LoB!BB19=\"None\",LoB!BB19=\"Fixed\"),\"OK\",\"Wrong\"))","v":""},{"$f":"IF(BB19<>\"OK\",\"\",IF(LoB!BB19=\"Empirical\",IF(OR(LoB!BC19=\"\",ISERROR(MATCH(LoB!BC19,Empirical!$B$1:$CW$1,0))),\"Not Available\",\"OK\"),IF(AND(LoB!BB19=\"Fixed\",LoB!BC19>=0),\"OK\",\"OK\")))","v":""},{"$f":"IF($E19<>\"Yes\",\"\",IF(OR(LoB!BD19=\"Empirical\",LoB!BD19=\"None\",LoB!BB19=\"Fixed\"),\"OK\",\"Wrong\"))","v":""},{"$f":"IF(BD19<>\"OK\",\"\",IF(LoB!BD19=\"Empirical\",IF(OR(LoB!BE19=\"\",ISERROR(MATCH(LoB!BE19,Empirical!$B$1:$CW$1,0))),\"Not Available\",\"OK\"),IF(AND(LoB!BD19=\"Fixed\",LoB!BE19>=0),\"OK\",\"OK\")))","v":""},{"$f":"IF($E19<>\"Yes\",\"\",IF(OR(LoB!BF19=\"\",ISERROR(MATCH(LoB!BF19,List!$M$2:$M$28,0))),\"Not Available\",\"OK\"))","v":""}]
[null,"Correct",{"$f":"IF(LoB!C20=\"\",\"\",LoB!C20)","v":""},{"$f":"IF(LoB!D20=\"\",\"\",LoB!D20)","v":""},{"$f":"IF(LoB!E20=\"\",\"\",LoB!E20)","v":""},{"$f":"IF($E20<>\"Yes\",\"\",IF(OR(LoB!F20=\"CondPaid\",LoB!F20=\"CondIncurLoss\"),\"OK\",IF(OR(AND(ISERROR(MATCH(LoB!F20,FactorTable!$B$1:$GS$1,0)),ISERROR(MATCH(LoB!F20,Function!$C$1:$CX$1,0)))),\"Not Available\",\"OK\")))","v":""},{"$f":"IF($E20<>\"Yes\",\"\",IF(OR(LoB!G20=\"\",AND(ISERROR(MATCH(LoB!G20,FactorTable!$B$1:$GS$1,0)),ISERROR(MATCH(LoB!G20,Function!$C$1:$CX$1,0)))),\"Not Available\",\"OK\"))","v":""},{"$f":"IF($E20<>\"Yes\",\"\",IF(OR(LoB!H20=\"CondPaid\",LoB!H20=\"CondIncurLoss\"),\"OK\",IF(OR(AND(ISERROR(MATCH(LoB!H20,FactorTable!$B$1:$GS$1,0)),ISERROR(MATCH(LoB!H20,Function!$C$1:$CX$1,0)))),\"Not Available\",\"OK\")))","v":""},{"$f":"IF($E20<>\"Yes\",\"\",IF(ISERROR(MATCH(LoB!I20,List!$A$2:$A$101,0)),\"Not Available\",\"OK\"))","v":""},{"$f":"IF(I20<>\"OK\",\"\",IF(LoB!I20=\"Empirical\",IF(OR(LoB!J20=\"\",ISERROR(MATCH(LoB!J20,Empirical!$B$1:$CW$1,0))),\"Not Available\",\"OK\"),IF(AND(VLOOKUP(LoB!I20,List!$A$2:$E$101,2,FALSE)<>\"\",LoB!J20<=VLOOKUP(LoB!I20,List!$A$2:$E$101,2,FALSE)),\"Too Small\",IF(AND(VLOOKUP(LoB!I20,List!$A$2:$E$101,3,FALSE)<>\"\",LoB!J20>=VLOOKUP(LoB!I20,List!$A$2:$E$101,3,FALSE)),\"Too Large\",\"OK\"))))","v":""},{"$f":"IF(I20<>\"OK\",\"\",IF(AND(VLOOKUP(LoB!I20,List!$A$2:$E$101,4,FALSE)<>\"\",LoB!K20<=VLOOKUP(LoB!I20,List!$A$2:$E$101,4,FALSE)),\"Too Small\",IF(AND(VLOOKUP(LoB!I20,List!$A$2:$E$101,5,FALSE)<>\"\",LoB!K20>=VLOOKUP(LoB!I20,List!$A$2:$E$101,5,FALSE)),\"Too Large\",\"OK\")))","v":""},null,{"$f":"IF(I20<>\"OK\",\"\",IF(AND(LoB!L20=\"Yes\",LoB!M20>LoB!N20),\"Min > Max\",IF(AND(LoB!L20=\"Yes\",NOT(ISNUMBER(LoB!M20))),\"Not Number\",\"OK\")))","v":""},{"$f":"IF(I20<>\"OK\",\"\",IF(AND(LoB!L20=\"Yes\",LoB!M20>LoB!N20),\"Min > Max\",IF(AND(LoB!L20=\"Yes\",NOT(ISNUMBER(LoB!N20))),\"Not Number\",\"OK\")))","v":""},{"$f":"IF($E20<>\"Yes\",\"\",IF(ISERROR(MATCH(LoB!O20,List!$A$2:$A$101,0)),\"Not Available\",\"OK\"))","v":""},{"$f":"IF(O20<>\"OK\",\"\",IF(LoB!O20=\"Empirical\",IF(OR(LoB!P20=\"\",ISERROR(MATCH(LoB!P20,Empirical!$B$1:$CW$1,0))),\"Not Available\",\"OK\"),IF(AND(VLOOKUP(LoB!O20,List!$A$2:$E$101,2,FALSE)<>\"\",LoB!P20<=VLOOKUP(LoB!O20,List!$A$2:$E$101,2,FALSE)),\"Too Small\",IF(AND(VLOOKUP(LoB!O20,List!$A$2:$E$101,3,FALSE)<>\"\",LoB!P20>=VLOOKUP(LoB!O20,List!$A$2:$E$101,3,FALSE)),\"Too Large\",\"OK\"))))","v":""},{"$f":"IF(O20<>\"OK\",\"\",IF(AND(VLOOKUP(LoB!O20,List!$A$2:$E$101,4,FALSE)<>\"\",LoB!Q20<=VLOOKUP(LoB!O20,List!$A$2:$E$101,4,FALSE)),\"Too Small\",IF(AND(VLOOKUP(LoB!O20,List!$A$2:$E$101,5,FALSE)<>\"\",LoB!Q20>=VLOOKUP(LoB!O20,List!$A$2:$E$101,5,FALSE)),\"Too Large\",\"OK\")))","v":""},null,{"$f":"IF(O20<>\"OK\",\"\",IF(AND(LoB!R20=\"Yes\",LoB!S20>LoB!T20),\"Min > Max\",IF(AND(LoB!R20=\"Yes\",NOT(ISNUMBER(LoB!S20))),\"Not Number\",\"OK\")))","v":""},{"$f":"IF(O20<>\"OK\",\"\",IF(AND(LoB!R20=\"Yes\",LoB!S20>LoB!T20),\"Min > Max\",IF(AND(LoB!R20=\"Yes\",NOT(ISNUMBER(LoB!T20))),\"Not Number\",\"OK\")))","v":""},{"$f":"IF($E20<>\"Yes\",\"\",IF(OR(LoB!U20=\"\",ISERROR(MATCH(LoB!U20,Index!$B$1:$CW$1,0))),\"Not Available\",\"OK\"))","v":""},{"$f":"IF($E20<>\"Yes\",\"\",IF(ISERROR(MATCH(LoB!V20,List!$A$2:$A$101,0)),\"Not Available\",\"OK\"))","v":""},{"$f":"IF(V20<>\"OK\",\"\",IF(LoB!V20=\"Empirical\",IF(OR(LoB!W20=\"\",ISERROR(MATCH(LoB!W20,Empirical!$B$1:$CW$1,0))),\"Not Available\",\"OK\"),IF(AND(VLOOKUP(LoB!V20,List!$A$2:$E$101,2,FALSE)<>\"\",LoB!W20<=VLOOKUP(LoB!V20,List!$A$2:$E$101,2,FALSE)),\"Too Small\",IF(AND(VLOOKUP(LoB!V20,List!$A$2:$E$101,3,FALSE)<>\"\",LoB!W20>=VLOOKUP(LoB!V20,List!$A$2:$E$101,3,FALSE)),\"Too Large\",\"OK\"))))","v":""},{"$f":"IF(V20<>\"OK\",\"\",IF(AND(VLOOKUP(LoB!V20,List!$A$2:$E$101,4,FALSE)<>\"\",LoB!X20<=VLOOKUP(LoB!V20,List!$A$2:$E$101,4,FALSE)),\"Too Small\",IF(AND(VLOOKUP(LoB!V20,List!$A$2:$E$101,5,FALSE)<>\"\",LoB!X20>=VLOOKUP(LoB!V20,List!$A$2:$E$101,5,FALSE)),\"Too Large\",\"OK\")))","v":""},null,{"$f":"IF(V20<>\"OK\",\"\",IF(AND(LoB!Y20=\"Yes\",LoB!Z20>LoB!AA20),\"Min > Max\",IF(AND(LoB!Y20=\"Yes\",NOT(ISNUMBER(LoB!Z20))),\"Not Number\",\"OK\")))","v":""},{"$f":"IF(V20<>\"OK\",\"\",IF(AND(LoB!Y20=\"Yes\",LoB!Z20>LoB!AA20),\"Min > Max\",IF(AND(LoB!Y20=\"Yes\",NOT(ISNUMBER(LoB!AA20))),\"Not Number\",\"OK\")))","v":""},{"$f":"IF($E20<>\"Yes\",\"\",IF(OR(LoB!AB20=\"\",ISERROR(MATCH(LoB!AB20,Index!$B$1:$CW$1,0))),\"Not Available\",\"OK\"))","v":""},{"$f":"IF($E20<>\"Yes\",\"\",IF(OR(LoB!AC20=\"CLOSED\",LoB!AC20=\"ALL\"),\"OK\",\"Not Available\"))","v":""},{"$f":"IF($E20<>\"Yes\",\"\",IF(ISERROR(MATCH(LoB!AD20,List!$A$2:$A$101,0)),\"Not Available\",\"OK\"))","v":""},{"$f":"IF(AD20<>\"OK\",\"\",IF(LoB!AD20=\"Empirical\",IF(OR(LoB!AE20=\"\",ISERROR(MATCH(LoB!AE20,Empirical!$B$1:$CW$1,0))),\"Not Available\",\"OK\"),IF(AND(VLOOKUP(LoB!AD20,List!$A$2:$E$101,2,FALSE)<>\"\",LoB!AE20<=VLOOKUP(LoB!AD20,List!$A$2:$E$101,2,FALSE)),\"Too Small\",IF(AND(VLOOKUP(LoB!AD20,List!$A$2:$E$101,3,FALSE)<>\"\",LoB!AE20>=VLOOKUP(LoB!AD20,List!$A$2:$E$101,3,FALSE)),\"Too Large\",\"OK\"))))","v":""},{"$f":"IF(AD20<>\"OK\",\"\",IF(AND(VLOOKUP(LoB!AD20,List!$A$2:$E$101,4,FALSE)<>\"\",LoB!AF20<=VLOOKUP(LoB!AD20,List!$A$2:$E$101,4,FALSE)),\"Too Small\",IF(AND(VLOOKUP(LoB!AD20,List!$A$2:$E$101,5,FALSE)<>\"\",LoB!AF20>=VLOOKUP(LoB!AD20,List!$A$2:$E$101,5,FALSE)),\"Too Large\",\"OK\")))","v":""},null,{"$f":"IF(AD20<>\"OK\",\"\",IF(AND(LoB!AG20=\"Yes\",LoB!AH20>LoB!AI20),\"Min > Max\",IF(AND(LoB!AG20=\"Yes\",NOT(ISNUMBER(LoB!AH20))),\"Not Number\",\"OK\")))","v":""},{"$f":"IF(AD20<>\"OK\",\"\",IF(AND(LoB!AG20=\"Yes\",LoB!AH20>LoB!AI20),\"Min > Max\",IF(AND(LoB!AG20=\"Yes\",NOT(ISNUMBER(LoB!AI20))),\"Not Number\",\"OK\")))","v":""},{"$f":"IF($E20<>\"Yes\",\"\",IF(ISERROR(MATCH(LoB!AJ20,List!$A$2:$A$101,0)),\"Not Available\",\"OK\"))","v":""},{"$f":"IF(AJ20<>\"OK\",\"\",IF(LoB!AJ20=\"Empirical\",IF(OR(LoB!AK20=\"\",ISERROR(MATCH(LoB!AK20,Empirical!$B$1:$CW$1,0))),\"Not Available\",\"OK\"),IF(AND(VLOOKUP(LoB!AJ20,List!$A$2:$E$101,2,FALSE)<>\"\",LoB!AK20<=VLOOKUP(LoB!AJ20,List!$A$2:$E$101,2,FALSE)),\"Too Small\",IF(AND(VLOOKUP(LoB!AJ20,List!$A$2:$E$101,3,FALSE)<>\"\",LoB!AK20>=VLOOKUP(LoB!AJ20,List!$A$2:$E$101,3,FALSE)),\"Too Large\",\"OK\"))))","v":""},{"$f":"IF(AJ20<>\"OK\",\"\",IF(AND(VLOOKUP(LoB!AJ20,List!$A$2:$E$101,4,FALSE)<>\"\",LoB!AL20<=VLOOKUP(LoB!AJ20,List!$A$2:$E$101,4,FALSE)),\"Too Small\",IF(AND(VLOOKUP(LoB!AJ20,List!$A$2:$E$101,5,FALSE)<>\"\",LoB!AL20>=VLOOKUP(LoB!AJ20,List!$A$2:$E$101,5,FALSE)),\"Too Large\",\"OK\")))","v":""},null,{"$f":"IF(AJ20<>\"OK\",\"\",IF(AND(LoB!AM20=\"Yes\",LoB!AN20>LoB!AO20),\"Min > Max\",IF(AND(LoB!AM20=\"Yes\",NOT(ISNUMBER(LoB!AN20))),\"Not Number\",\"OK\")))","v":""},{"$f":"IF(AJ20<>\"OK\",\"\",IF(AND(LoB!AM20=\"Yes\",LoB!AN20>LoB!AO20),\"Min > Max\",IF(AND(LoB!AM20=\"Yes\",NOT(ISNUMBER(LoB!AO20))),\"Not Number\",\"OK\")))","v":""},{"$f":"IF($E20<>\"Yes\",\"\",IF(ISERROR(MATCH(LoB!AP20,List!$A$2:$A$101,0)),\"Not Available\",\"OK\"))","v":""},{"$f":"IF(AP20<>\"OK\",\"\",IF(LoB!AP20=\"Empirical\",IF(OR(LoB!AQ20=\"\",ISERROR(MATCH(LoB!AQ20,Empirical!$B$1:$CW$1,0))),\"Not Available\",\"OK\"),IF(AND(VLOOKUP(LoB!AP20,List!$A$2:$E$101,2,FALSE)<>\"\",LoB!AQ20<=VLOOKUP(LoB!AP20,List!$A$2:$E$101,2,FALSE)),\"Too Small\",IF(AND(VLOOKUP(LoB!AP20,List!$A$2:$E$101,3,FALSE)<>\"\",LoB!AQ20>=VLOOKUP(LoB!AP20,List!$A$2:$E$101,3,FALSE)),\"Too Large\",\"OK\"))))","v":""},{"$f":"IF(AP20<>\"OK\",\"\",IF(AND(VLOOKUP(LoB!AP20,List!$A$2:$E$101,4,FALSE)<>\"\",LoB!AR20<=VLOOKUP(LoB!AP20,List!$A$2:$E$101,4,FALSE)),\"Too Small\",IF(AND(VLOOKUP(LoB!AP20,List!$A$2:$E$101,5,FALSE)<>\"\",LoB!AR20>=VLOOKUP(LoB!AP20,List!$A$2:$E$101,5,FALSE)),\"Too Large\",\"OK\")))","v":""},null,{"$f":"IF(AP20<>\"OK\",\"\",IF(AND(LoB!AS20=\"Yes\",LoB!AT20>LoB!AU20),\"Min > Max\",IF(AND(LoB!AS20=\"Yes\",NOT(ISNUMBER(LoB!AT20))),\"Not Number\",\"OK\")))","v":""},{"$f":"IF(AP20<>\"OK\",\"\",IF(AND(LoB!AS20=\"Yes\",LoB!AT20>LoB!AU20),\"Min > Max\",IF(AND(LoB!AS20=\"Yes\",NOT(ISNUMBER(LoB!AU20))),\"Not Number\",\"OK\")))","v":""},{"$f":"IF($E20<>\"Yes\",\"\",IF(ISERROR(MATCH(LoB!AV20,List!$F$2:$F$101,0)),\"Not Available\",\"OK\"))","v":""},{"$f":"IF(AV20<>\"OK\",\"\",IF(LoB!AV20=\"Independent\",\"OK\",IF(OR(AND(LoB!AV20=\"clayton\",LoB!AW20<-1),AND(OR(LoB!AV20=\"gumbel\",LoB!AV20=\"joe\"),LoB!AW20<1),AND(LoB!AV20<>\"normal\",LoB!AV20<>\"t\",LoB!AW20=0)),\"Invalid Value\",IF(AND(OR(LoB!AV20=\"normal\",LoB!AV20=\"t\"),ABS(LoB!AW20)>1),\"|Correlation|>1\",IF(AND(OR(LoB!AV20=\"normal\",LoB!AV20=\"t\"),LoB!AW20=\"\"),\"No Value\",\"OK\")))))","v":""},{"$f":"IF(AV20<>\"OK\",\"\",IF(LoB!AV20=\"Independent\",\"OK\", IF(AND(OR(LoB!AV20=\"normal\",LoB!AV20=\"t\"),1-LoB!AW20*LoB!AX20<0),\"Non Positive Semidefinite\",IF(ABS(LoB!AX20)>1,\"|Correlation|>1\",IF(LoB!AX20=\"\",\"No Value\",\"OK\")))))","v":""},{"$f":"IF(AV20<>\"OK\",\"\",IF(AND(OR(LoB!AV20=\"normal\",LoB!AV20=\"t\"),detm(LoB!AW20,LoB!AX20,LoB!AY20)<0),\"Non Positive Semidefinite\",IF(ABS(LoB!AY20)>1,\"|Correlation >1\",IF(LoB!AY20=\"\",\"\",\"OK\"))))","v":""},{"$f":"IF(AV20<>\"OK\",\"\",IF(AND(LoB!AV20=\"t\",LoB!AZ20<=0),\"Wrong DoF\",\"OK\"))","v":""},{"$f":"IF($E20<>\"Yes\",\"\",IF(OR(LoB!BA20=\"\",AND(ISERROR(MATCH(LoB!BA20,FactorTable!$B$1:$GS$1,0)),ISERROR(MATCH(LoB!BA20,Function!$C$1:$CX$1,0)))),\"Not Available\",\"OK\"))","v":""},{"$f":"IF($E20<>\"Yes\",\"\",IF(OR(LoB!BB20=\"Empirical\",LoB!BB20=\"None\",LoB!BB20=\"Fixed\"),\"OK\",\"Wrong\"))","v":""},{"$f":"IF(BB20<>\"OK\",\"\",IF(LoB!BB20=\"Empirical\",IF(OR(LoB!BC20=\"\",ISERROR(MATCH(LoB!BC20,Empirical!$B$1:$CW$1,0))),\"Not Available\",\"OK\"),IF(AND(LoB!BB20=\"Fixed\",LoB!BC20>=0),\"OK\",\"OK\")))","v":""},{"$f":"IF($E20<>\"Yes\",\"\",IF(OR(LoB!BD20=\"Empirical\",LoB!BD20=\"None\",LoB!BB20=\"Fixed\"),\"OK\",\"Wrong\"))","v":""},{"$f":"IF(BD20<>\"OK\",\"\",IF(LoB!BD20=\"Empirical\",IF(OR(LoB!BE20=\"\",ISERROR(MATCH(LoB!BE20,Empirical!$B$1:$CW$1,0))),\"Not Available\",\"OK\"),IF(AND(LoB!BD20=\"Fixed\",LoB!BE20>=0),\"OK\",\"OK\")))","v":""},{"$f":"IF($E20<>\"Yes\",\"\",IF(OR(LoB!BF20=\"\",ISERROR(MATCH(LoB!BF20,List!$M$2:$M$28,0))),\"Not Available\",\"OK\"))","v":""}]
[null,"Correct",{"$f":"IF(LoB!C21=\"\",\"\",LoB!C21)","v":""},{"$f":"IF(LoB!D21=\"\",\"\",LoB!D21)","v":""},{"$f":"IF(LoB!E21=\"\",\"\",LoB!E21)","v":""},{"$f":"IF($E21<>\"Yes\",\"\",IF(OR(LoB!F21=\"CondPaid\",LoB!F21=\"CondIncurLoss\"),\"OK\",IF(OR(AND(ISERROR(MATCH(LoB!F21,FactorTable!$B$1:$GS$1,0)),ISERROR(MATCH(LoB!F21,Function!$C$1:$CX$1,0)))),\"Not Available\",\"OK\")))","v":""},{"$f":"IF($E21<>\"Yes\",\"\",IF(OR(LoB!G21=\"\",AND(ISERROR(MATCH(LoB!G21,FactorTable!$B$1:$GS$1,0)),ISERROR(MATCH(LoB!G21,Function!$C$1:$CX$1,0)))),\"Not Available\",\"OK\"))","v":""},{"$f":"IF($E21<>\"Yes\",\"\",IF(OR(LoB!H21=\"CondPaid\",LoB!H21=\"CondIncurLoss\"),\"OK\",IF(OR(AND(ISERROR(MATCH(LoB!H21,FactorTable!$B$1:$GS$1,0)),ISERROR(MATCH(LoB!H21,Function!$C$1:$CX$1,0)))),\"Not Available\",\"OK\")))","v":""},{"$f":"IF($E21<>\"Yes\",\"\",IF(ISERROR(MATCH(LoB!I21,List!$A$2:$A$101,0)),\"Not Available\",\"OK\"))","v":""},{"$f":"IF(I21<>\"OK\",\"\",IF(LoB!I21=\"Empirical\",IF(OR(LoB!J21=\"\",ISERROR(MATCH(LoB!J21,Empirical!$B$1:$CW$1,0))),\"Not Available\",\"OK\"),IF(AND(VLOOKUP(LoB!I21,List!$A$2:$E$101,2,FALSE)<>\"\",LoB!J21<=VLOOKUP(LoB!I21,List!$A$2:$E$101,2,FALSE)),\"Too Small\",IF(AND(VLOOKUP(LoB!I21,List!$A$2:$E$101,3,FALSE)<>\"\",LoB!J21>=VLOOKUP(LoB!I21,List!$A$2:$E$101,3,FALSE)),\"Too Large\",\"OK\"))))","v":""},{"$f":"IF(I21<>\"OK\",\"\",IF(AND(VLOOKUP(LoB!I21,List!$A$2:$E$101,4,FALSE)<>\"\",LoB!K21<=VLOOKUP(LoB!I21,List!$A$2:$E$101,4,FALSE)),\"Too Small\",IF(AND(VLOOKUP(LoB!I21,List!$A$2:$E$101,5,FALSE)<>\"\",LoB!K21>=VLOOKUP(LoB!I21,List!$A$2:$E$101,5,FALSE)),\"Too Large\",\"OK\")))","v":""},null,{"$f":"IF(I21<>\"OK\",\"\",IF(AND(LoB!L21=\"Yes\",LoB!M21>LoB!N21),\"Min > Max\",IF(AND(LoB!L21=\"Yes\",NOT(ISNUMBER(LoB!M21))),\"Not Number\",\"OK\")))","v":""},{"$f":"IF(I21<>\"OK\",\"\",IF(AND(LoB!L21=\"Yes\",LoB!M21>LoB!N21),\"Min > Max\",IF(AND(LoB!L21=\"Yes\",NOT(ISNUMBER(LoB!N21))),\"Not Number\",\"OK\")))","v":""},{"$f":"IF($E21<>\"Yes\",\"\",IF(ISERROR(MATCH(LoB!O21,List!$A$2:$A$101,0)),\"Not Available\",\"OK\"))","v":""},{"$f":"IF(O21<>\"OK\",\"\",IF(LoB!O21=\"Empirical\",IF(OR(LoB!P21=\"\",ISERROR(MATCH(LoB!P21,Empirical!$B$1:$CW$1,0))),\"Not Available\",\"OK\"),IF(AND(VLOOKUP(LoB!O21,List!$A$2:$E$101,2,FALSE)<>\"\",LoB!P21<=VLOOKUP(LoB!O21,List!$A$2:$E$101,2,FALSE)),\"Too Small\",IF(AND(VLOOKUP(LoB!O21,List!$A$2:$E$101,3,FALSE)<>\"\",LoB!P21>=VLOOKUP(LoB!O21,List!$A$2:$E$101,3,FALSE)),\"Too Large\",\"OK\"))))","v":""},{"$f":"IF(O21<>\"OK\",\"\",IF(AND(VLOOKUP(LoB!O21,List!$A$2:$E$101,4,FALSE)<>\"\",LoB!Q21<=VLOOKUP(LoB!O21,List!$A$2:$E$101,4,FALSE)),\"Too Small\",IF(AND(VLOOKUP(LoB!O21,List!$A$2:$E$101,5,FALSE)<>\"\",LoB!Q21>=VLOOKUP(LoB!O21,List!$A$2:$E$101,5,FALSE)),\"Too Large\",\"OK\")))","v":""},null,{"$f":"IF(O21<>\"OK\",\"\",IF(AND(LoB!R21=\"Yes\",LoB!S21>LoB!T21),\"Min > Max\",IF(AND(LoB!R21=\"Yes\",NOT(ISNUMBER(LoB!S21))),\"Not Number\",\"OK\")))","v":""},{"$f":"IF(O21<>\"OK\",\"\",IF(AND(LoB!R21=\"Yes\",LoB!S21>LoB!T21),\"Min > Max\",IF(AND(LoB!R21=\"Yes\",NOT(ISNUMBER(LoB!T21))),\"Not Number\",\"OK\")))","v":""},{"$f":"IF($E21<>\"Yes\",\"\",IF(OR(LoB!U21=\"\",ISERROR(MATCH(LoB!U21,Index!$B$1:$CW$1,0))),\"Not Available\",\"OK\"))","v":""},{"$f":"IF($E21<>\"Yes\",\"\",IF(ISERROR(MATCH(LoB!V21,List!$A$2:$A$101,0)),\"Not Available\",\"OK\"))","v":""},{"$f":"IF(V21<>\"OK\",\"\",IF(LoB!V21=\"Empirical\",IF(OR(LoB!W21=\"\",ISERROR(MATCH(LoB!W21,Empirical!$B$1:$CW$1,0))),\"Not Available\",\"OK\"),IF(AND(VLOOKUP(LoB!V21,List!$A$2:$E$101,2,FALSE)<>\"\",LoB!W21<=VLOOKUP(LoB!V21,List!$A$2:$E$101,2,FALSE)),\"Too Small\",IF(AND(VLOOKUP(LoB!V21,List!$A$2:$E$101,3,FALSE)<>\"\",LoB!W21>=VLOOKUP(LoB!V21,List!$A$2:$E$101,3,FALSE)),\"Too Large\",\"OK\"))))","v":""},{"$f":"IF(V21<>\"OK\",\"\",IF(AND(VLOOKUP(LoB!V21,List!$A$2:$E$101,4,FALSE)<>\"\",LoB!X21<=VLOOKUP(LoB!V21,List!$A$2:$E$101,4,FALSE)),\"Too Small\",IF(AND(VLOOKUP(LoB!V21,List!$A$2:$E$101,5,FALSE)<>\"\",LoB!X21>=VLOOKUP(LoB!V21,List!$A$2:$E$101,5,FALSE)),\"Too Large\",\"OK\")))","v":""},null,{"$f":"IF(V21<>\"OK\",\"\",IF(AND(LoB!Y21=\"Yes\",LoB!Z21>LoB!AA21),\"Min > Max\",IF(AND(LoB!Y21=\"Yes\",NOT(ISNUMBER(LoB!Z21))),\"Not Number\",\"OK\")))","v":""},{"$f":"IF(V21<>\"OK\",\"\",IF(AND(LoB!Y21=\"Yes\",LoB!Z21>LoB!AA21),\"Min > Max\",IF(AND(LoB!Y21=\"Yes\",NOT(ISNUMBER(LoB!AA21))),\"Not Number\",\"OK\")))","v":""},{"$f":"IF($E21<>\"Yes\",\"\",IF(OR(LoB!AB21=\"\",ISERROR(MATCH(LoB!AB21,Index!$B$1:$CW$1,0))),\"Not Available\",\"OK\"))","v":""},{"$f":"IF($E21<>\"Yes\",\"\",IF(OR(LoB!AC21=\"CLOSED\",LoB!AC21=\"ALL\"),\"OK\",\"Not Available\"))","v":""},{"$f":"IF($E21<>\"Yes\",\"\",IF(ISERROR(MATCH(LoB!AD21,List!$A$2:$A$101,0)),\"Not Available\",\"OK\"))","v":""},{"$f":"IF(AD21<>\"OK\",\"\",IF(LoB!AD21=\"Empirical\",IF(OR(LoB!AE21=\"\",ISERROR(MATCH(LoB!AE21,Empirical!$B$1:$CW$1,0))),\"Not Available\",\"OK\"),IF(AND(VLOOKUP(LoB!AD21,List!$A$2:$E$101,2,FALSE)<>\"\",LoB!AE21<=VLOOKUP(LoB!AD21,List!$A$2:$E$101,2,FALSE)),\"Too Small\",IF(AND(VLOOKUP(LoB!AD21,List!$A$2:$E$101,3,FALSE)<>\"\",LoB!AE21>=VLOOKUP(LoB!AD21,List!$A$2:$E$101,3,FALSE)),\"Too Large\",\"OK\"))))","v":""},{"$f":"IF(AD21<>\"OK\",\"\",IF(AND(VLOOKUP(LoB!AD21,List!$A$2:$E$101,4,FALSE)<>\"\",LoB!AF21<=VLOOKUP(LoB!AD21,List!$A$2:$E$101,4,FALSE)),\"Too Small\",IF(AND(VLOOKUP(LoB!AD21,List!$A$2:$E$101,5,FALSE)<>\"\",LoB!AF21>=VLOOKUP(LoB!AD21,List!$A$2:$E$101,5,FALSE)),\"Too Large\",\"OK\")))","v":""},null,{"$f":"IF(AD21<>\"OK\",\"\",IF(AND(LoB!AG21=\"Yes\",LoB!AH21>LoB!AI21),\"Min > Max\",IF(AND(LoB!AG21=\"Yes\",NOT(ISNUMBER(LoB!AH21))),\"Not Number\",\"OK\")))","v":""},{"$f":"IF(AD21<>\"OK\",\"\",IF(AND(LoB!AG21=\"Yes\",LoB!AH21>LoB!AI21),\"Min > Max\",IF(AND(LoB!AG21=\"Yes\",NOT(ISNUMBER(LoB!AI21))),\"Not Number\",\"OK\")))","v":""},{"$f":"IF($E21<>\"Yes\",\"\",IF(ISERROR(MATCH(LoB!AJ21,List!$A$2:$A$101,0)),\"Not Available\",\"OK\"))","v":""},{"$f":"IF(AJ21<>\"OK\",\"\",IF(LoB!AJ21=\"Empirical\",IF(OR(LoB!AK21=\"\",ISERROR(MATCH(LoB!AK21,Empirical!$B$1:$CW$1,0))),\"Not Available\",\"OK\"),IF(AND(VLOOKUP(LoB!AJ21,List!$A$2:$E$101,2,FALSE)<>\"\",LoB!AK21<=VLOOKUP(LoB!AJ21,List!$A$2:$E$101,2,FALSE)),\"Too Small\",IF(AND(VLOOKUP(LoB!AJ21,List!$A$2:$E$101,3,FALSE)<>\"\",LoB!AK21>=VLOOKUP(LoB!AJ21,List!$A$2:$E$101,3,FALSE)),\"Too Large\",\"OK\"))))","v":""},{"$f":"IF(AJ21<>\"OK\",\"\",IF(AND(VLOOKUP(LoB!AJ21,List!$A$2:$E$101,4,FALSE)<>\"\",LoB!AL21<=VLOOKUP(LoB!AJ21,List!$A$2:$E$101,4,FALSE)),\"Too Small\",IF(AND(VLOOKUP(LoB!AJ21,List!$A$2:$E$101,5,FALSE)<>\"\",LoB!AL21>=VLOOKUP(LoB!AJ21,List!$A$2:$E$101,5,FALSE)),\"Too Large\",\"OK\")))","v":""},null,{"$f":"IF(AJ21<>\"OK\",\"\",IF(AND(LoB!AM21=\"Yes\",LoB!AN21>LoB!AO21),\"Min > Max\",IF(AND(LoB!AM21=\"Yes\",NOT(ISNUMBER(LoB!AN21))),\"Not Number\",\"OK\")))","v":""},{"$f":"IF(AJ21<>\"OK\",\"\",IF(AND(LoB!AM21=\"Yes\",LoB!AN21>LoB!AO21),\"Min > Max\",IF(AND(LoB!AM21=\"Yes\",NOT(ISNUMBER(LoB!AO21))),\"Not Number\",\"OK\")))","v":""},{"$f":"IF($E21<>\"Yes\",\"\",IF(ISERROR(MATCH(LoB!AP21,List!$A$2:$A$101,0)),\"Not Available\",\"OK\"))","v":""},{"$f":"IF(AP21<>\"OK\",\"\",IF(LoB!AP21=\"Empirical\",IF(OR(LoB!AQ21=\"\",ISERROR(MATCH(LoB!AQ21,Empirical!$B$1:$CW$1,0))),\"Not Available\",\"OK\"),IF(AND(VLOOKUP(LoB!AP21,List!$A$2:$E$101,2,FALSE)<>\"\",LoB!AQ21<=VLOOKUP(LoB!AP21,List!$A$2:$E$101,2,FALSE)),\"Too Small\",IF(AND(VLOOKUP(LoB!AP21,List!$A$2:$E$101,3,FALSE)<>\"\",LoB!AQ21>=VLOOKUP(LoB!AP21,List!$A$2:$E$101,3,FALSE)),\"Too Large\",\"OK\"))))","v":""},{"$f":"IF(AP21<>\"OK\",\"\",IF(AND(VLOOKUP(LoB!AP21,List!$A$2:$E$101,4,FALSE)<>\"\",LoB!AR21<=VLOOKUP(LoB!AP21,List!$A$2:$E$101,4,FALSE)),\"Too Small\",IF(AND(VLOOKUP(LoB!AP21,List!$A$2:$E$101,5,FALSE)<>\"\",LoB!AR21>=VLOOKUP(LoB!AP21,List!$A$2:$E$101,5,FALSE)),\"Too Large\",\"OK\")))","v":""},null,{"$f":"IF(AP21<>\"OK\",\"\",IF(AND(LoB!AS21=\"Yes\",LoB!AT21>LoB!AU21),\"Min > Max\",IF(AND(LoB!AS21=\"Yes\",NOT(ISNUMBER(LoB!AT21))),\"Not Number\",\"OK\")))","v":""},{"$f":"IF(AP21<>\"OK\",\"\",IF(AND(LoB!AS21=\"Yes\",LoB!AT21>LoB!AU21),\"Min > Max\",IF(AND(LoB!AS21=\"Yes\",NOT(ISNUMBER(LoB!AU21))),\"Not Number\",\"OK\")))","v":""},{"$f":"IF($E21<>\"Yes\",\"\",IF(ISERROR(MATCH(LoB!AV21,List!$F$2:$F$101,0)),\"Not Available\",\"OK\"))","v":""},{"$f":"IF(AV21<>\"OK\",\"\",IF(LoB!AV21=\"Independent\",\"OK\",IF(OR(AND(LoB!AV21=\"clayton\",LoB!AW21<-1),AND(OR(LoB!AV21=\"gumbel\",LoB!AV21=\"joe\"),LoB!AW21<1),AND(LoB!AV21<>\"normal\",LoB!AV21<>\"t\",LoB!AW21=0)),\"Invalid Value\",IF(AND(OR(LoB!AV21=\"normal\",LoB!AV21=\"t\"),ABS(LoB!AW21)>1),\"|Correlation|>1\",IF(AND(OR(LoB!AV21=\"normal\",LoB!AV21=\"t\"),LoB!AW21=\"\"),\"No Value\",\"OK\")))))","v":""},{"$f":"IF(AV21<>\"OK\",\"\",IF(LoB!AV21=\"Independent\",\"OK\", IF(AND(OR(LoB!AV21=\"normal\",LoB!AV21=\"t\"),1-LoB!AW21*LoB!AX21<0),\"Non Positive Semidefinite\",IF(ABS(LoB!AX21)>1,\"|Correlation|>1\",IF(LoB!AX21=\"\",\"No Value\",\"OK\")))))","v":""},{"$f":"IF(AV21<>\"OK\",\"\",IF(AND(OR(LoB!AV21=\"normal\",LoB!AV21=\"t\"),detm(LoB!AW21,LoB!AX21,LoB!AY21)<0),\"Non Positive Semidefinite\",IF(ABS(LoB!AY21)>1,\"|Correlation >1\",IF(LoB!AY21=\"\",\"\",\"OK\"))))","v":""},{"$f":"IF(AV21<>\"OK\",\"\",IF(AND(LoB!AV21=\"t\",LoB!AZ21<=0),\"Wrong DoF\",\"OK\"))","v":""},{"$f":"IF($E21<>\"Yes\",\"\",IF(OR(LoB!BA21=\"\",AND(ISERROR(MATCH(LoB!BA21,FactorTable!$B$1:$GS$1,0)),ISERROR(MATCH(LoB!BA21,Function!$C$1:$CX$1,0)))),\"Not Available\",\"OK\"))","v":""},{"$f":"IF($E21<>\"Yes\",\"\",IF(OR(LoB!BB21=\"Empirical\",LoB!BB21=\"None\",LoB!BB21=\"Fixed\"),\"OK\",\"Wrong\"))","v":""},{"$f":"IF(BB21<>\"OK\",\"\",IF(LoB!BB21=\"Empirical\",IF(OR(LoB!BC21=\"\",ISERROR(MATCH(LoB!BC21,Empirical!$B$1:$CW$1,0))),\"Not Available\",\"OK\"),IF(AND(LoB!BB21=\"Fixed\",LoB!BC21>=0),\"OK\",\"OK\")))","v":""},{"$f":"IF($E21<>\"Yes\",\"\",IF(OR(LoB!BD21=\"Empirical\",LoB!BD21=\"None\",LoB!BB21=\"Fixed\"),\"OK\",\"Wrong\"))","v":""},{"$f":"IF(BD21<>\"OK\",\"\",IF(LoB!BD21=\"Empirical\",IF(OR(LoB!BE21=\"\",ISERROR(MATCH(LoB!BE21,Empirical!$B$1:$CW$1,0))),\"Not Available\",\"OK\"),IF(AND(LoB!BD21=\"Fixed\",LoB!BE21>=0),\"OK\",\"OK\")))","v":""},{"$f":"IF($E21<>\"Yes\",\"\",IF(OR(LoB!BF21=\"\",ISERROR(MATCH(LoB!BF21,List!$M$2:$M$28,0))),\"Not Available\",\"OK\"))","v":""}]
[null,"Correct",{"$f":"IF(LoB!C22=\"\",\"\",LoB!C22)","v":""},{"$f":"IF(LoB!D22=\"\",\"\",LoB!D22)","v":""},{"$f":"IF(LoB!E22=\"\",\"\",LoB!E22)","v":""},{"$f":"IF($E22<>\"Yes\",\"\",IF(OR(LoB!F22=\"CondPaid\",LoB!F22=\"CondIncurLoss\"),\"OK\",IF(OR(AND(ISERROR(MATCH(LoB!F22,FactorTable!$B$1:$GS$1,0)),ISERROR(MATCH(LoB!F22,Function!$C$1:$CX$1,0)))),\"Not Available\",\"OK\")))","v":""},{"$f":"IF($E22<>\"Yes\",\"\",IF(OR(LoB!G22=\"\",AND(ISERROR(MATCH(LoB!G22,FactorTable!$B$1:$GS$1,0)),ISERROR(MATCH(LoB!G22,Function!$C$1:$CX$1,0)))),\"Not Available\",\"OK\"))","v":""},{"$f":"IF($E22<>\"Yes\",\"\",IF(OR(LoB!H22=\"CondPaid\",LoB!H22=\"CondIncurLoss\"),\"OK\",IF(OR(AND(ISERROR(MATCH(LoB!H22,FactorTable!$B$1:$GS$1,0)),ISERROR(MATCH(LoB!H22,Function!$C$1:$CX$1,0)))),\"Not Available\",\"OK\")))","v":""},{"$f":"IF($E22<>\"Yes\",\"\",IF(ISERROR(MATCH(LoB!I22,List!$A$2:$A$101,0)),\"Not Available\",\"OK\"))","v":""},{"$f":"IF(I22<>\"OK\",\"\",IF(LoB!I22=\"Empirical\",IF(OR(LoB!J22=\"\",ISERROR(MATCH(LoB!J22,Empirical!$B$1:$CW$1,0))),\"Not Available\",\"OK\"),IF(AND(VLOOKUP(LoB!I22,List!$A$2:$E$101,2,FALSE)<>\"\",LoB!J22<=VLOOKUP(LoB!I22,List!$A$2:$E$101,2,FALSE)),\"Too Small\",IF(AND(VLOOKUP(LoB!I22,List!$A$2:$E$101,3,FALSE)<>\"\",LoB!J22>=VLOOKUP(LoB!I22,List!$A$2:$E$101,3,FALSE)),\"Too Large\",\"OK\"))))","v":""},{"$f":"IF(I22<>\"OK\",\"\",IF(AND(VLOOKUP(LoB!I22,List!$A$2:$E$101,4,FALSE)<>\"\",LoB!K22<=VLOOKUP(LoB!I22,List!$A$2:$E$101,4,FALSE)),\"Too Small\",IF(AND(VLOOKUP(LoB!I22,List!$A$2:$E$101,5,FALSE)<>\"\",LoB!K22>=VLOOKUP(LoB!I22,List!$A$2:$E$101,5,FALSE)),\"Too Large\",\"OK\")))","v":""},null,{"$f":"IF(I22<>\"OK\",\"\",IF(AND(LoB!L22=\"Yes\",LoB!M22>LoB!N22),\"Min > Max\",IF(AND(LoB!L22=\"Yes\",NOT(ISNUMBER(LoB!M22))),\"Not Number\",\"OK\")))","v":""},{"$f":"IF(I22<>\"OK\",\"\",IF(AND(LoB!L22=\"Yes\",LoB!M22>LoB!N22),\"Min > Max\",IF(AND(LoB!L22=\"Yes\",NOT(ISNUMBER(LoB!N22))),\"Not Number\",\"OK\")))","v":""},{"$f":"IF($E22<>\"Yes\",\"\",IF(ISERROR(MATCH(LoB!O22,List!$A$2:$A$101,0)),\"Not Available\",\"OK\"))","v":""},{"$f":"IF(O22<>\"OK\",\"\",IF(LoB!O22=\"Empirical\",IF(OR(LoB!P22=\"\",ISERROR(MATCH(LoB!P22,Empirical!$B$1:$CW$1,0))),\"Not Available\",\"OK\"),IF(AND(VLOOKUP(LoB!O22,List!$A$2:$E$101,2,FALSE)<>\"\",LoB!P22<=VLOOKUP(LoB!O22,List!$A$2:$E$101,2,FALSE)),\"Too Small\",IF(AND(VLOOKUP(LoB!O22,List!$A$2:$E$101,3,FALSE)<>\"\",LoB!P22>=VLOOKUP(LoB!O22,List!$A$2:$E$101,3,FALSE)),\"Too Large\",\"OK\"))))","v":""},{"$f":"IF(O22<>\"OK\",\"\",IF(AND(VLOOKUP(LoB!O22,List!$A$2:$E$101,4,FALSE)<>\"\",LoB!Q22<=VLOOKUP(LoB!O22,List!$A$2:$E$101,4,FALSE)),\"Too Small\",IF(AND(VLOOKUP(LoB!O22,List!$A$2:$E$101,5,FALSE)<>\"\",LoB!Q22>=VLOOKUP(LoB!O22,List!$A$2:$E$101,5,FALSE)),\"Too Large\",\"OK\")))","v":""},null,{"$f":"IF(O22<>\"OK\",\"\",IF(AND(LoB!R22=\"Yes\",LoB!S22>LoB!T22),\"Min > Max\",IF(AND(LoB!R22=\"Yes\",NOT(ISNUMBER(LoB!S22))),\"Not Number\",\"OK\")))","v":""},{"$f":"IF(O22<>\"OK\",\"\",IF(AND(LoB!R22=\"Yes\",LoB!S22>LoB!T22),\"Min > Max\",IF(AND(LoB!R22=\"Yes\",NOT(ISNUMBER(LoB!T22))),\"Not Number\",\"OK\")))","v":""},{"$f":"IF($E22<>\"Yes\",\"\",IF(OR(LoB!U22=\"\",ISERROR(MATCH(LoB!U22,Index!$B$1:$CW$1,0))),\"Not Available\",\"OK\"))","v":""},{"$f":"IF($E22<>\"Yes\",\"\",IF(ISERROR(MATCH(LoB!V22,List!$A$2:$A$101,0)),\"Not Available\",\"OK\"))","v":""},{"$f":"IF(V22<>\"OK\",\"\",IF(LoB!V22=\"Empirical\",IF(OR(LoB!W22=\"\",ISERROR(MATCH(LoB!W22,Empirical!$B$1:$CW$1,0))),\"Not Available\",\"OK\"),IF(AND(VLOOKUP(LoB!V22,List!$A$2:$E$101,2,FALSE)<>\"\",LoB!W22<=VLOOKUP(LoB!V22,List!$A$2:$E$101,2,FALSE)),\"Too Small\",IF(AND(VLOOKUP(LoB!V22,List!$A$2:$E$101,3,FALSE)<>\"\",LoB!W22>=VLOOKUP(LoB!V22,List!$A$2:$E$101,3,FALSE)),\"Too Large\",\"OK\"))))","v":""},{"$f":"IF(V22<>\"OK\",\"\",IF(AND(VLOOKUP(LoB!V22,List!$A$2:$E$101,4,FALSE)<>\"\",LoB!X22<=VLOOKUP(LoB!V22,List!$A$2:$E$101,4,FALSE)),\"Too Small\",IF(AND(VLOOKUP(LoB!V22,List!$A$2:$E$101,5,FALSE)<>\"\",LoB!X22>=VLOOKUP(LoB!V22,List!$A$2:$E$101,5,FALSE)),\"Too Large\",\"OK\")))","v":""},null,{"$f":"IF(V22<>\"OK\",\"\",IF(AND(LoB!Y22=\"Yes\",LoB!Z22>LoB!AA22),\"Min > Max\",IF(AND(LoB!Y22=\"Yes\",NOT(ISNUMBER(LoB!Z22))),\"Not Number\",\"OK\")))","v":""},{"$f":"IF(V22<>\"OK\",\"\",IF(AND(LoB!Y22=\"Yes\",LoB!Z22>LoB!AA22),\"Min > Max\",IF(AND(LoB!Y22=\"Yes\",NOT(ISNUMBER(LoB!AA22))),\"Not Number\",\"OK\")))","v":""},{"$f":"IF($E22<>\"Yes\",\"\",IF(OR(LoB!AB22=\"\",ISERROR(MATCH(LoB!AB22,Index!$B$1:$CW$1,0))),\"Not Available\",\"OK\"))","v":""},{"$f":"IF($E22<>\"Yes\",\"\",IF(OR(LoB!AC22=\"CLOSED\",LoB!AC22=\"ALL\"),\"OK\",\"Not Available\"))","v":""},{"$f":"IF($E22<>\"Yes\",\"\",IF(ISERROR(MATCH(LoB!AD22,List!$A$2:$A$101,0)),\"Not Available\",\"OK\"))","v":""},{"$f":"IF(AD22<>\"OK\",\"\",IF(LoB!AD22=\"Empirical\",IF(OR(LoB!AE22=\"\",ISERROR(MATCH(LoB!AE22,Empirical!$B$1:$CW$1,0))),\"Not Available\",\"OK\"),IF(AND(VLOOKUP(LoB!AD22,List!$A$2:$E$101,2,FALSE)<>\"\",LoB!AE22<=VLOOKUP(LoB!AD22,List!$A$2:$E$101,2,FALSE)),\"Too Small\",IF(AND(VLOOKUP(LoB!AD22,List!$A$2:$E$101,3,FALSE)<>\"\",LoB!AE22>=VLOOKUP(LoB!AD22,List!$A$2:$E$101,3,FALSE)),\"Too Large\",\"OK\"))))","v":""},{"$f":"IF(AD22<>\"OK\",\"\",IF(AND(VLOOKUP(LoB!AD22,List!$A$2:$E$101,4,FALSE)<>\"\",LoB!AF22<=VLOOKUP(LoB!AD22,List!$A$2:$E$101,4,FALSE)),\"Too Small\",IF(AND(VLOOKUP(LoB!AD22,List!$A$2:$E$101,5,FALSE)<>\"\",LoB!AF22>=VLOOKUP(LoB!AD22,List!$A$2:$E$101,5,FALSE)),\"Too Large\",\"OK\")))","v":""},null,{"$f":"IF(AD22<>\"OK\",\"\",IF(AND(LoB!AG22=\"Yes\",LoB!AH22>LoB!AI22),\"Min > Max\",IF(AND(LoB!AG22=\"Yes\",NOT(ISNUMBER(LoB!AH22))),\"Not Number\",\"OK\")))","v":""},{"$f":"IF(AD22<>\"OK\",\"\",IF(AND(LoB!AG22=\"Yes\",LoB!AH22>LoB!AI22),\"Min > Max\",IF(AND(LoB!AG22=\"Yes\",NOT(ISNUMBER(LoB!AI22))),\"Not Number\",\"OK\")))","v":""},{"$f":"IF($E22<>\"Yes\",\"\",IF(ISERROR(MATCH(LoB!AJ22,List!$A$2:$A$101,0)),\"Not Available\",\"OK\"))","v":""},{"$f":"IF(AJ22<>\"OK\",\"\",IF(LoB!AJ22=\"Empirical\",IF(OR(LoB!AK22=\"\",ISERROR(MATCH(LoB!AK22,Empirical!$B$1:$CW$1,0))),\"Not Available\",\"OK\"),IF(AND(VLOOKUP(LoB!AJ22,List!$A$2:$E$101,2,FALSE)<>\"\",LoB!AK22<=VLOOKUP(LoB!AJ22,List!$A$2:$E$101,2,FALSE)),\"Too Small\",IF(AND(VLOOKUP(LoB!AJ22,List!$A$2:$E$101,3,FALSE)<>\"\",LoB!AK22>=VLOOKUP(LoB!AJ22,List!$A$2:$E$101,3,FALSE)),\"Too Large\",\"OK\"))))","v":""},{"$f":"IF(AJ22<>\"OK\",\"\",IF(AND(VLOOKUP(LoB!AJ22,List!$A$2:$E$101,4,FALSE)<>\"\",LoB!AL22<=VLOOKUP(LoB!AJ22,List!$A$2:$E$101,4,FALSE)),\"Too Small\",IF(AND(VLOOKUP(LoB!AJ22,List!$A$2:$E$101,5,FALSE)<>\"\",LoB!AL22>=VLOOKUP(LoB!AJ22,List!$A$2:$E$101,5,FALSE)),\"Too Large\",\"OK\")))","v":""},null,{"$f":"IF(AJ22<>\"OK\",\"\",IF(AND(LoB!AM22=\"Yes\",LoB!AN22>LoB!AO22),\"Min > Max\",IF(AND(LoB!AM22=\"Yes\",NOT(ISNUMBER(LoB!AN22))),\"Not Number\",\"OK\")))","v":""},{"$f":"IF(AJ22<>\"OK\",\"\",IF(AND(LoB!AM22=\"Yes\",LoB!AN22>LoB!AO22),\"Min > Max\",IF(AND(LoB!AM22=\"Yes\",NOT(ISNUMBER(LoB!AO22))),\"Not Number\",\"OK\")))","v":""},{"$f":"IF($E22<>\"Yes\",\"\",IF(ISERROR(MATCH(LoB!AP22,List!$A$2:$A$101,0)),\"Not Available\",\"OK\"))","v":""},{"$f":"IF(AP22<>\"OK\",\"\",IF(LoB!AP22=\"Empirical\",IF(OR(LoB!AQ22=\"\",ISERROR(MATCH(LoB!AQ22,Empirical!$B$1:$CW$1,0))),\"Not Available\",\"OK\"),IF(AND(VLOOKUP(LoB!AP22,List!$A$2:$E$101,2,FALSE)<>\"\",LoB!AQ22<=VLOOKUP(LoB!AP22,List!$A$2:$E$101,2,FALSE)),\"Too Small\",IF(AND(VLOOKUP(LoB!AP22,List!$A$2:$E$101,3,FALSE)<>\"\",LoB!AQ22>=VLOOKUP(LoB!AP22,List!$A$2:$E$101,3,FALSE)),\"Too Large\",\"OK\"))))","v":""},{"$f":"IF(AP22<>\"OK\",\"\",IF(AND(VLOOKUP(LoB!AP22,List!$A$2:$E$101,4,FALSE)<>\"\",LoB!AR22<=VLOOKUP(LoB!AP22,List!$A$2:$E$101,4,FALSE)),\"Too Small\",IF(AND(VLOOKUP(LoB!AP22,List!$A$2:$E$101,5,FALSE)<>\"\",LoB!AR22>=VLOOKUP(LoB!AP22,List!$A$2:$E$101,5,FALSE)),\"Too Large\",\"OK\")))","v":""},null,{"$f":"IF(AP22<>\"OK\",\"\",IF(AND(LoB!AS22=\"Yes\",LoB!AT22>LoB!AU22),\"Min > Max\",IF(AND(LoB!AS22=\"Yes\",NOT(ISNUMBER(LoB!AT22))),\"Not Number\",\"OK\")))","v":""},{"$f":"IF(AP22<>\"OK\",\"\",IF(AND(LoB!AS22=\"Yes\",LoB!AT22>LoB!AU22),\"Min > Max\",IF(AND(LoB!AS22=\"Yes\",NOT(ISNUMBER(LoB!AU22))),\"Not Number\",\"OK\")))","v":""},{"$f":"IF($E22<>\"Yes\",\"\",IF(ISERROR(MATCH(LoB!AV22,List!$F$2:$F$101,0)),\"Not Available\",\"OK\"))","v":""},{"$f":"IF(AV22<>\"OK\",\"\",IF(LoB!AV22=\"Independent\",\"OK\",IF(OR(AND(LoB!AV22=\"clayton\",LoB!AW22<-1),AND(OR(LoB!AV22=\"gumbel\",LoB!AV22=\"joe\"),LoB!AW22<1),AND(LoB!AV22<>\"normal\",LoB!AV22<>\"t\",LoB!AW22=0)),\"Invalid Value\",IF(AND(OR(LoB!AV22=\"normal\",LoB!AV22=\"t\"),ABS(LoB!AW22)>1),\"|Correlation|>1\",IF(AND(OR(LoB!AV22=\"normal\",LoB!AV22=\"t\"),LoB!AW22=\"\"),\"No Value\",\"OK\")))))","v":""},{"$f":"IF(AV22<>\"OK\",\"\",IF(LoB!AV22=\"Independent\",\"OK\", IF(AND(OR(LoB!AV22=\"normal\",LoB!AV22=\"t\"),1-LoB!AW22*LoB!AX22<0),\"Non Positive Semidefinite\",IF(ABS(LoB!AX22)>1,\"|Correlation|>1\",IF(LoB!AX22=\"\",\"No Value\",\"OK\")))))","v":""},{"$f":"IF(AV22<>\"OK\",\"\",IF(AND(OR(LoB!AV22=\"normal\",LoB!AV22=\"t\"),detm(LoB!AW22,LoB!AX22,LoB!AY22)<0),\"Non Positive Semidefinite\",IF(ABS(LoB!AY22)>1,\"|Correlation >1\",IF(LoB!AY22=\"\",\"\",\"OK\"))))","v":""},{"$f":"IF(AV22<>\"OK\",\"\",IF(AND(LoB!AV22=\"t\",LoB!AZ22<=0),\"Wrong DoF\",\"OK\"))","v":""},{"$f":"IF($E22<>\"Yes\",\"\",IF(OR(LoB!BA22=\"\",AND(ISERROR(MATCH(LoB!BA22,FactorTable!$B$1:$GS$1,0)),ISERROR(MATCH(LoB!BA22,Function!$C$1:$CX$1,0)))),\"Not Available\",\"OK\"))","v":""},{"$f":"IF($E22<>\"Yes\",\"\",IF(OR(LoB!BB22=\"Empirical\",LoB!BB22=\"None\",LoB!BB22=\"Fixed\"),\"OK\",\"Wrong\"))","v":""},{"$f":"IF(BB22<>\"OK\",\"\",IF(LoB!BB22=\"Empirical\",IF(OR(LoB!BC22=\"\",ISERROR(MATCH(LoB!BC22,Empirical!$B$1:$CW$1,0))),\"Not Available\",\"OK\"),IF(AND(LoB!BB22=\"Fixed\",LoB!BC22>=0),\"OK\",\"OK\")))","v":""},{"$f":"IF($E22<>\"Yes\",\"\",IF(OR(LoB!BD22=\"Empirical\",LoB!BD22=\"None\",LoB!BB22=\"Fixed\"),\"OK\",\"Wrong\"))","v":""},{"$f":"IF(BD22<>\"OK\",\"\",IF(LoB!BD22=\"Empirical\",IF(OR(LoB!BE22=\"\",ISERROR(MATCH(LoB!BE22,Empirical!$B$1:$CW$1,0))),\"Not Available\",\"OK\"),IF(AND(LoB!BD22=\"Fixed\",LoB!BE22>=0),\"OK\",\"OK\")))","v":""},{"$f":"IF($E22<>\"Yes\",\"\",IF(OR(LoB!BF22=\"\",ISERROR(MATCH(LoB!BF22,List!$M$2:$M$28,0))),\"Not Available\",\"OK\"))","v":""}]
[null,"Correct",{"$f":"IF(LoB!C23=\"\",\"\",LoB!C23)","v":""},{"$f":"IF(LoB!D23=\"\",\"\",LoB!D23)","v":""},{"$f":"IF(LoB!E23=\"\",\"\",LoB!E23)","v":""},{"$f":"IF($E23<>\"Yes\",\"\",IF(OR(LoB!F23=\"CondPaid\",LoB!F23=\"CondIncurLoss\"),\"OK\",IF(OR(AND(ISERROR(MATCH(LoB!F23,FactorTable!$B$1:$GS$1,0)),ISERROR(MATCH(LoB!F23,Function!$C$1:$CX$1,0)))),\"Not Available\",\"OK\")))","v":""},{"$f":"IF($E23<>\"Yes\",\"\",IF(OR(LoB!G23=\"\",AND(ISERROR(MATCH(LoB!G23,FactorTable!$B$1:$GS$1,0)),ISERROR(MATCH(LoB!G23,Function!$C$1:$CX$1,0)))),\"Not Available\",\"OK\"))","v":""},{"$f":"IF($E23<>\"Yes\",\"\",IF(OR(LoB!H23=\"CondPaid\",LoB!H23=\"CondIncurLoss\"),\"OK\",IF(OR(AND(ISERROR(MATCH(LoB!H23,FactorTable!$B$1:$GS$1,0)),ISERROR(MATCH(LoB!H23,Function!$C$1:$CX$1,0)))),\"Not Available\",\"OK\")))","v":""},{"$f":"IF($E23<>\"Yes\",\"\",IF(ISERROR(MATCH(LoB!I23,List!$A$2:$A$101,0)),\"Not Available\",\"OK\"))","v":""},{"$f":"IF(I23<>\"OK\",\"\",IF(LoB!I23=\"Empirical\",IF(OR(LoB!J23=\"\",ISERROR(MATCH(LoB!J23,Empirical!$B$1:$CW$1,0))),\"Not Available\",\"OK\"),IF(AND(VLOOKUP(LoB!I23,List!$A$2:$E$101,2,FALSE)<>\"\",LoB!J23<=VLOOKUP(LoB!I23,List!$A$2:$E$101,2,FALSE)),\"Too Small\",IF(AND(VLOOKUP(LoB!I23,List!$A$2:$E$101,3,FALSE)<>\"\",LoB!J23>=VLOOKUP(LoB!I23,List!$A$2:$E$101,3,FALSE)),\"Too Large\",\"OK\"))))","v":""},{"$f":"IF(I23<>\"OK\",\"\",IF(AND(VLOOKUP(LoB!I23,List!$A$2:$E$101,4,FALSE)<>\"\",LoB!K23<=VLOOKUP(LoB!I23,List!$A$2:$E$101,4,FALSE)),\"Too Small\",IF(AND(VLOOKUP(LoB!I23,List!$A$2:$E$101,5,FALSE)<>\"\",LoB!K23>=VLOOKUP(LoB!I23,List!$A$2:$E$101,5,FALSE)),\"Too Large\",\"OK\")))","v":""},null,{"$f":"IF(I23<>\"OK\",\"\",IF(AND(LoB!L23=\"Yes\",LoB!M23>LoB!N23),\"Min > Max\",IF(AND(LoB!L23=\"Yes\",NOT(ISNUMBER(LoB!M23))),\"Not Number\",\"OK\")))","v":""},{"$f":"IF(I23<>\"OK\",\"\",IF(AND(LoB!L23=\"Yes\",LoB!M23>LoB!N23),\"Min > Max\",IF(AND(LoB!L23=\"Yes\",NOT(ISNUMBER(LoB!N23))),\"Not Number\",\"OK\")))","v":""},{"$f":"IF($E23<>\"Yes\",\"\",IF(ISERROR(MATCH(LoB!O23,List!$A$2:$A$101,0)),\"Not Available\",\"OK\"))","v":""},{"$f":"IF(O23<>\"OK\",\"\",IF(LoB!O23=\"Empirical\",IF(OR(LoB!P23=\"\",ISERROR(MATCH(LoB!P23,Empirical!$B$1:$CW$1,0))),\"Not Available\",\"OK\"),IF(AND(VLOOKUP(LoB!O23,List!$A$2:$E$101,2,FALSE)<>\"\",LoB!P23<=VLOOKUP(LoB!O23,List!$A$2:$E$101,2,FALSE)),\"Too Small\",IF(AND(VLOOKUP(LoB!O23,List!$A$2:$E$101,3,FALSE)<>\"\",LoB!P23>=VLOOKUP(LoB!O23,List!$A$2:$E$101,3,FALSE)),\"Too Large\",\"OK\"))))","v":""},{"$f":"IF(O23<>\"OK\",\"\",IF(AND(VLOOKUP(LoB!O23,List!$A$2:$E$101,4,FALSE)<>\"\",LoB!Q23<=VLOOKUP(LoB!O23,List!$A$2:$E$101,4,FALSE)),\"Too Small\",IF(AND(VLOOKUP(LoB!O23,List!$A$2:$E$101,5,FALSE)<>\"\",LoB!Q23>=VLOOKUP(LoB!O23,List!$A$2:$E$101,5,FALSE)),\"Too Large\",\"OK\")))","v":""},null,{"$f":"IF(O23<>\"OK\",\"\",IF(AND(LoB!R23=\"Yes\",LoB!S23>LoB!T23),\"Min > Max\",IF(AND(LoB!R23=\"Yes\",NOT(ISNUMBER(LoB!S23))),\"Not Number\",\"OK\")))","v":""},{"$f":"IF(O23<>\"OK\",\"\",IF(AND(LoB!R23=\"Yes\",LoB!S23>LoB!T23),\"Min > Max\",IF(AND(LoB!R23=\"Yes\",NOT(ISNUMBER(LoB!T23))),\"Not Number\",\"OK\")))","v":""},{"$f":"IF($E23<>\"Yes\",\"\",IF(OR(LoB!U23=\"\",ISERROR(MATCH(LoB!U23,Index!$B$1:$CW$1,0))),\"Not Available\",\"OK\"))","v":""},{"$f":"IF($E23<>\"Yes\",\"\",IF(ISERROR(MATCH(LoB!V23,List!$A$2:$A$101,0)),\"Not Available\",\"OK\"))","v":""},{"$f":"IF(V23<>\"OK\",\"\",IF(LoB!V23=\"Empirical\",IF(OR(LoB!W23=\"\",ISERROR(MATCH(LoB!W23,Empirical!$B$1:$CW$1,0))),\"Not Available\",\"OK\"),IF(AND(VLOOKUP(LoB!V23,List!$A$2:$E$101,2,FALSE)<>\"\",LoB!W23<=VLOOKUP(LoB!V23,List!$A$2:$E$101,2,FALSE)),\"Too Small\",IF(AND(VLOOKUP(LoB!V23,List!$A$2:$E$101,3,FALSE)<>\"\",LoB!W23>=VLOOKUP(LoB!V23,List!$A$2:$E$101,3,FALSE)),\"Too Large\",\"OK\"))))","v":""},{"$f":"IF(V23<>\"OK\",\"\",IF(AND(VLOOKUP(LoB!V23,List!$A$2:$E$101,4,FALSE)<>\"\",LoB!X23<=VLOOKUP(LoB!V23,List!$A$2:$E$101,4,FALSE)),\"Too Small\",IF(AND(VLOOKUP(LoB!V23,List!$A$2:$E$101,5,FALSE)<>\"\",LoB!X23>=VLOOKUP(LoB!V23,List!$A$2:$E$101,5,FALSE)),\"Too Large\",\"OK\")))","v":""},null,{"$f":"IF(V23<>\"OK\",\"\",IF(AND(LoB!Y23=\"Yes\",LoB!Z23>LoB!AA23),\"Min > Max\",IF(AND(LoB!Y23=\"Yes\",NOT(ISNUMBER(LoB!Z23))),\"Not Number\",\"OK\")))","v":""},{"$f":"IF(V23<>\"OK\",\"\",IF(AND(LoB!Y23=\"Yes\",LoB!Z23>LoB!AA23),\"Min > Max\",IF(AND(LoB!Y23=\"Yes\",NOT(ISNUMBER(LoB!AA23))),\"Not Number\",\"OK\")))","v":""},{"$f":"IF($E23<>\"Yes\",\"\",IF(OR(LoB!AB23=\"\",ISERROR(MATCH(LoB!AB23,Index!$B$1:$CW$1,0))),\"Not Available\",\"OK\"))","v":""},{"$f":"IF($E23<>\"Yes\",\"\",IF(OR(LoB!AC23=\"CLOSED\",LoB!AC23=\"ALL\"),\"OK\",\"Not Available\"))","v":""},{"$f":"IF($E23<>\"Yes\",\"\",IF(ISERROR(MATCH(LoB!AD23,List!$A$2:$A$101,0)),\"Not Available\",\"OK\"))","v":""},{"$f":"IF(AD23<>\"OK\",\"\",IF(LoB!AD23=\"Empirical\",IF(OR(LoB!AE23=\"\",ISERROR(MATCH(LoB!AE23,Empirical!$B$1:$CW$1,0))),\"Not Available\",\"OK\"),IF(AND(VLOOKUP(LoB!AD23,List!$A$2:$E$101,2,FALSE)<>\"\",LoB!AE23<=VLOOKUP(LoB!AD23,List!$A$2:$E$101,2,FALSE)),\"Too Small\",IF(AND(VLOOKUP(LoB!AD23,List!$A$2:$E$101,3,FALSE)<>\"\",LoB!AE23>=VLOOKUP(LoB!AD23,List!$A$2:$E$101,3,FALSE)),\"Too Large\",\"OK\"))))","v":""},{"$f":"IF(AD23<>\"OK\",\"\",IF(AND(VLOOKUP(LoB!AD23,List!$A$2:$E$101,4,FALSE)<>\"\",LoB!AF23<=VLOOKUP(LoB!AD23,List!$A$2:$E$101,4,FALSE)),\"Too Small\",IF(AND(VLOOKUP(LoB!AD23,List!$A$2:$E$101,5,FALSE)<>\"\",LoB!AF23>=VLOOKUP(LoB!AD23,List!$A$2:$E$101,5,FALSE)),\"Too Large\",\"OK\")))","v":""},null,{"$f":"IF(AD23<>\"OK\",\"\",IF(AND(LoB!AG23=\"Yes\",LoB!AH23>LoB!AI23),\"Min > Max\",IF(AND(LoB!AG23=\"Yes\",NOT(ISNUMBER(LoB!AH23))),\"Not Number\",\"OK\")))","v":""},{"$f":"IF(AD23<>\"OK\",\"\",IF(AND(LoB!AG23=\"Yes\",LoB!AH23>LoB!AI23),\"Min > Max\",IF(AND(LoB!AG23=\"Yes\",NOT(ISNUMBER(LoB!AI23))),\"Not Number\",\"OK\")))","v":""},{"$f":"IF($E23<>\"Yes\",\"\",IF(ISERROR(MATCH(LoB!AJ23,List!$A$2:$A$101,0)),\"Not Available\",\"OK\"))","v":""},{"$f":"IF(AJ23<>\"OK\",\"\",IF(LoB!AJ23=\"Empirical\",IF(OR(LoB!AK23=\"\",ISERROR(MATCH(LoB!AK23,Empirical!$B$1:$CW$1,0))),\"Not Available\",\"OK\"),IF(AND(VLOOKUP(LoB!AJ23,List!$A$2:$E$101,2,FALSE)<>\"\",LoB!AK23<=VLOOKUP(LoB!AJ23,List!$A$2:$E$101,2,FALSE)),\"Too Small\",IF(AND(VLOOKUP(LoB!AJ23,List!$A$2:$E$101,3,FALSE)<>\"\",LoB!AK23>=VLOOKUP(LoB!AJ23,List!$A$2:$E$101,3,FALSE)),\"Too Large\",\"OK\"))))","v":""},{"$f":"IF(AJ23<>\"OK\",\"\",IF(AND(VLOOKUP(LoB!AJ23,List!$A$2:$E$101,4,FALSE)<>\"\",LoB!AL23<=VLOOKUP(LoB!AJ23,List!$A$2:$E$101,4,FALSE)),\"Too Small\",IF(AND(VLOOKUP(LoB!AJ23,List!$A$2:$E$101,5,FALSE)<>\"\",LoB!AL23>=VLOOKUP(LoB!AJ23,List!$A$2:$E$101,5,FALSE)),\"Too Large\",\"OK\")))","v":""},null,{"$f":"IF(AJ23<>\"OK\",\"\",IF(AND(LoB!AM23=\"Yes\",LoB!AN23>LoB!AO23),\"Min > Max\",IF(AND(LoB!AM23=\"Yes\",NOT(ISNUMBER(LoB!AN23))),\"Not Number\",\"OK\")))","v":""},{"$f":"IF(AJ23<>\"OK\",\"\",IF(AND(LoB!AM23=\"Yes\",LoB!AN23>LoB!AO23),\"Min > Max\",IF(AND(LoB!AM23=\"Yes\",NOT(ISNUMBER(LoB!AO23))),\"Not Number\",\"OK\")))","v":""},{"$f":"IF($E23<>\"Yes\",\"\",IF(ISERROR(MATCH(LoB!AP23,List!$A$2:$A$101,0)),\"Not Available\",\"OK\"))","v":""},{"$f":"IF(AP23<>\"OK\",\"\",IF(LoB!AP23=\"Empirical\",IF(OR(LoB!AQ23=\"\",ISERROR(MATCH(LoB!AQ23,Empirical!$B$1:$CW$1,0))),\"Not Available\",\"OK\"),IF(AND(VLOOKUP(LoB!AP23,List!$A$2:$E$101,2,FALSE)<>\"\",LoB!AQ23<=VLOOKUP(LoB!AP23,List!$A$2:$E$101,2,FALSE)),\"Too Small\",IF(AND(VLOOKUP(LoB!AP23,List!$A$2:$E$101,3,FALSE)<>\"\",LoB!AQ23>=VLOOKUP(LoB!AP23,List!$A$2:$E$101,3,FALSE)),\"Too Large\",\"OK\"))))","v":""},{"$f":"IF(AP23<>\"OK\",\"\",IF(AND(VLOOKUP(LoB!AP23,List!$A$2:$E$101,4,FALSE)<>\"\",LoB!AR23<=VLOOKUP(LoB!AP23,List!$A$2:$E$101,4,FALSE)),\"Too Small\",IF(AND(VLOOKUP(LoB!AP23,List!$A$2:$E$101,5,FALSE)<>\"\",LoB!AR23>=VLOOKUP(LoB!AP23,List!$A$2:$E$101,5,FALSE)),\"Too Large\",\"OK\")))","v":""},null,{"$f":"IF(AP23<>\"OK\",\"\",IF(AND(LoB!AS23=\"Yes\",LoB!AT23>LoB!AU23),\"Min > Max\",IF(AND(LoB!AS23=\"Yes\",NOT(ISNUMBER(LoB!AT23))),\"Not Number\",\"OK\")))","v":""},{"$f":"IF(AP23<>\"OK\",\"\",IF(AND(LoB!AS23=\"Yes\",LoB!AT23>LoB!AU23),\"Min > Max\",IF(AND(LoB!AS23=\"Yes\",NOT(ISNUMBER(LoB!AU23))),\"Not Number\",\"OK\")))","v":""},{"$f":"IF($E23<>\"Yes\",\"\",IF(ISERROR(MATCH(LoB!AV23,List!$F$2:$F$101,0)),\"Not Available\",\"OK\"))","v":""},{"$f":"IF(AV23<>\"OK\",\"\",IF(LoB!AV23=\"Independent\",\"OK\",IF(OR(AND(LoB!AV23=\"clayton\",LoB!AW23<-1),AND(OR(LoB!AV23=\"gumbel\",LoB!AV23=\"joe\"),LoB!AW23<1),AND(LoB!AV23<>\"normal\",LoB!AV23<>\"t\",LoB!AW23=0)),\"Invalid Value\",IF(AND(OR(LoB!AV23=\"normal\",LoB!AV23=\"t\"),ABS(LoB!AW23)>1),\"|Correlation|>1\",IF(AND(OR(LoB!AV23=\"normal\",LoB!AV23=\"t\"),LoB!AW23=\"\"),\"No Value\",\"OK\")))))","v":""},{"$f":"IF(AV23<>\"OK\",\"\",IF(LoB!AV23=\"Independent\",\"OK\", IF(AND(OR(LoB!AV23=\"normal\",LoB!AV23=\"t\"),1-LoB!AW23*LoB!AX23<0),\"Non Positive Semidefinite\",IF(ABS(LoB!AX23)>1,\"|Correlation|>1\",IF(LoB!AX23=\"\",\"No Value\",\"OK\")))))","v":""},{"$f":"IF(AV23<>\"OK\",\"\",IF(AND(OR(LoB!AV23=\"normal\",LoB!AV23=\"t\"),detm(LoB!AW23,LoB!AX23,LoB!AY23)<0),\"Non Positive Semidefinite\",IF(ABS(LoB!AY23)>1,\"|Correlation >1\",IF(LoB!AY23=\"\",\"\",\"OK\"))))","v":""},{"$f":"IF(AV23<>\"OK\",\"\",IF(AND(LoB!AV23=\"t\",LoB!AZ23<=0),\"Wrong DoF\",\"OK\"))","v":""},{"$f":"IF($E23<>\"Yes\",\"\",IF(OR(LoB!BA23=\"\",AND(ISERROR(MATCH(LoB!BA23,FactorTable!$B$1:$GS$1,0)),ISERROR(MATCH(LoB!BA23,Function!$C$1:$CX$1,0)))),\"Not Available\",\"OK\"))","v":""},{"$f":"IF($E23<>\"Yes\",\"\",IF(OR(LoB!BB23=\"Empirical\",LoB!BB23=\"None\",LoB!BB23=\"Fixed\"),\"OK\",\"Wrong\"))","v":""},{"$f":"IF(BB23<>\"OK\",\"\",IF(LoB!BB23=\"Empirical\",IF(OR(LoB!BC23=\"\",ISERROR(MATCH(LoB!BC23,Empirical!$B$1:$CW$1,0))),\"Not Available\",\"OK\"),IF(AND(LoB!BB23=\"Fixed\",LoB!BC23>=0),\"OK\",\"OK\")))","v":""},{"$f":"IF($E23<>\"Yes\",\"\",IF(OR(LoB!BD23=\"Empirical\",LoB!BD23=\"None\",LoB!BB23=\"Fixed\"),\"OK\",\"Wrong\"))","v":""},{"$f":"IF(BD23<>\"OK\",\"\",IF(LoB!BD23=\"Empirical\",IF(OR(LoB!BE23=\"\",ISERROR(MATCH(LoB!BE23,Empirical!$B$1:$CW$1,0))),\"Not Available\",\"OK\"),IF(AND(LoB!BD23=\"Fixed\",LoB!BE23>=0),\"OK\",\"OK\")))","v":""},{"$f":"IF($E23<>\"Yes\",\"\",IF(OR(LoB!BF23=\"\",ISERROR(MATCH(LoB!BF23,List!$M$2:$M$28,0))),\"Not Available\",\"OK\"))","v":""}]
[null,"Correct",{"$f":"IF(LoB!C24=\"\",\"\",LoB!C24)","v":""},{"$f":"IF(LoB!D24=\"\",\"\",LoB!D24)","v":""},{"$f":"IF(LoB!E24=\"\",\"\",LoB!E24)","v":""},{"$f":"IF($E24<>\"Yes\",\"\",IF(OR(LoB!F24=\"CondPaid\",LoB!F24=\"CondIncurLoss\"),\"OK\",IF(OR(AND(ISERROR(MATCH(LoB!F24,FactorTable!$B$1:$GS$1,0)),ISERROR(MATCH(LoB!F24,Function!$C$1:$CX$1,0)))),\"Not Available\",\"OK\")))","v":""},{"$f":"IF($E24<>\"Yes\",\"\",IF(OR(LoB!G24=\"\",AND(ISERROR(MATCH(LoB!G24,FactorTable!$B$1:$GS$1,0)),ISERROR(MATCH(LoB!G24,Function!$C$1:$CX$1,0)))),\"Not Available\",\"OK\"))","v":""},{"$f":"IF($E24<>\"Yes\",\"\",IF(OR(LoB!H24=\"CondPaid\",LoB!H24=\"CondIncurLoss\"),\"OK\",IF(OR(AND(ISERROR(MATCH(LoB!H24,FactorTable!$B$1:$GS$1,0)),ISERROR(MATCH(LoB!H24,Function!$C$1:$CX$1,0)))),\"Not Available\",\"OK\")))","v":""},{"$f":"IF($E24<>\"Yes\",\"\",IF(ISERROR(MATCH(LoB!I24,List!$A$2:$A$101,0)),\"Not Available\",\"OK\"))","v":""},{"$f":"IF(I24<>\"OK\",\"\",IF(LoB!I24=\"Empirical\",IF(OR(LoB!J24=\"\",ISERROR(MATCH(LoB!J24,Empirical!$B$1:$CW$1,0))),\"Not Available\",\"OK\"),IF(AND(VLOOKUP(LoB!I24,List!$A$2:$E$101,2,FALSE)<>\"\",LoB!J24<=VLOOKUP(LoB!I24,List!$A$2:$E$101,2,FALSE)),\"Too Small\",IF(AND(VLOOKUP(LoB!I24,List!$A$2:$E$101,3,FALSE)<>\"\",LoB!J24>=VLOOKUP(LoB!I24,List!$A$2:$E$101,3,FALSE)),\"Too Large\",\"OK\"))))","v":""},{"$f":"IF(I24<>\"OK\",\"\",IF(AND(VLOOKUP(LoB!I24,List!$A$2:$E$101,4,FALSE)<>\"\",LoB!K24<=VLOOKUP(LoB!I24,List!$A$2:$E$101,4,FALSE)),\"Too Small\",IF(AND(VLOOKUP(LoB!I24,List!$A$2:$E$101,5,FALSE)<>\"\",LoB!K24>=VLOOKUP(LoB!I24,List!$A$2:$E$101,5,FALSE)),\"Too Large\",\"OK\")))","v":""},null,{"$f":"IF(I24<>\"OK\",\"\",IF(AND(LoB!L24=\"Yes\",LoB!M24>LoB!N24),\"Min > Max\",IF(AND(LoB!L24=\"Yes\",NOT(ISNUMBER(LoB!M24))),\"Not Number\",\"OK\")))","v":""},{"$f":"IF(I24<>\"OK\",\"\",IF(AND(LoB!L24=\"Yes\",LoB!M24>LoB!N24),\"Min > Max\",IF(AND(LoB!L24=\"Yes\",NOT(ISNUMBER(LoB!N24))),\"Not Number\",\"OK\")))","v":""},{"$f":"IF($E24<>\"Yes\",\"\",IF(ISERROR(MATCH(LoB!O24,List!$A$2:$A$101,0)),\"Not Available\",\"OK\"))","v":""},{"$f":"IF(O24<>\"OK\",\"\",IF(LoB!O24=\"Empirical\",IF(OR(LoB!P24=\"\",ISERROR(MATCH(LoB!P24,Empirical!$B$1:$CW$1,0))),\"Not Available\",\"OK\"),IF(AND(VLOOKUP(LoB!O24,List!$A$2:$E$101,2,FALSE)<>\"\",LoB!P24<=VLOOKUP(LoB!O24,List!$A$2:$E$101,2,FALSE)),\"Too Small\",IF(AND(VLOOKUP(LoB!O24,List!$A$2:$E$101,3,FALSE)<>\"\",LoB!P24>=VLOOKUP(LoB!O24,List!$A$2:$E$101,3,FALSE)),\"Too Large\",\"OK\"))))","v":""},{"$f":"IF(O24<>\"OK\",\"\",IF(AND(VLOOKUP(LoB!O24,List!$A$2:$E$101,4,FALSE)<>\"\",LoB!Q24<=VLOOKUP(LoB!O24,List!$A$2:$E$101,4,FALSE)),\"Too Small\",IF(AND(VLOOKUP(LoB!O24,List!$A$2:$E$101,5,FALSE)<>\"\",LoB!Q24>=VLOOKUP(LoB!O24,List!$A$2:$E$101,5,FALSE)),\"Too Large\",\"OK\")))","v":""},null,{"$f":"IF(O24<>\"OK\",\"\",IF(AND(LoB!R24=\"Yes\",LoB!S24>LoB!T24),\"Min > Max\",IF(AND(LoB!R24=\"Yes\",NOT(ISNUMBER(LoB!S24))),\"Not Number\",\"OK\")))","v":""},{"$f":"IF(O24<>\"OK\",\"\",IF(AND(LoB!R24=\"Yes\",LoB!S24>LoB!T24),\"Min > Max\",IF(AND(LoB!R24=\"Yes\",NOT(ISNUMBER(LoB!T24))),\"Not Number\",\"OK\")))","v":""},{"$f":"IF($E24<>\"Yes\",\"\",IF(OR(LoB!U24=\"\",ISERROR(MATCH(LoB!U24,Index!$B$1:$CW$1,0))),\"Not Available\",\"OK\"))","v":""},{"$f":"IF($E24<>\"Yes\",\"\",IF(ISERROR(MATCH(LoB!V24,List!$A$2:$A$101,0)),\"Not Available\",\"OK\"))","v":""},{"$f":"IF(V24<>\"OK\",\"\",IF(LoB!V24=\"Empirical\",IF(OR(LoB!W24=\"\",ISERROR(MATCH(LoB!W24,Empirical!$B$1:$CW$1,0))),\"Not Available\",\"OK\"),IF(AND(VLOOKUP(LoB!V24,List!$A$2:$E$101,2,FALSE)<>\"\",LoB!W24<=VLOOKUP(LoB!V24,List!$A$2:$E$101,2,FALSE)),\"Too Small\",IF(AND(VLOOKUP(LoB!V24,List!$A$2:$E$101,3,FALSE)<>\"\",LoB!W24>=VLOOKUP(LoB!V24,List!$A$2:$E$101,3,FALSE)),\"Too Large\",\"OK\"))))","v":""},{"$f":"IF(V24<>\"OK\",\"\",IF(AND(VLOOKUP(LoB!V24,List!$A$2:$E$101,4,FALSE)<>\"\",LoB!X24<=VLOOKUP(LoB!V24,List!$A$2:$E$101,4,FALSE)),\"Too Small\",IF(AND(VLOOKUP(LoB!V24,List!$A$2:$E$101,5,FALSE)<>\"\",LoB!X24>=VLOOKUP(LoB!V24,List!$A$2:$E$101,5,FALSE)),\"Too Large\",\"OK\")))","v":""},null,{"$f":"IF(V24<>\"OK\",\"\",IF(AND(LoB!Y24=\"Yes\",LoB!Z24>LoB!AA24),\"Min > Max\",IF(AND(LoB!Y24=\"Yes\",NOT(ISNUMBER(LoB!Z24))),\"Not Number\",\"OK\")))","v":""},{"$f":"IF(V24<>\"OK\",\"\",IF(AND(LoB!Y24=\"Yes\",LoB!Z24>LoB!AA24),\"Min > Max\",IF(AND(LoB!Y24=\"Yes\",NOT(ISNUMBER(LoB!AA24))),\"Not Number\",\"OK\")))","v":""},{"$f":"IF($E24<>\"Yes\",\"\",IF(OR(LoB!AB24=\"\",ISERROR(MATCH(LoB!AB24,Index!$B$1:$CW$1,0))),\"Not Available\",\"OK\"))","v":""},{"$f":"IF($E24<>\"Yes\",\"\",IF(OR(LoB!AC24=\"CLOSED\",LoB!AC24=\"ALL\"),\"OK\",\"Not Available\"))","v":""},{"$f":"IF($E24<>\"Yes\",\"\",IF(ISERROR(MATCH(LoB!AD24,List!$A$2:$A$101,0)),\"Not Available\",\"OK\"))","v":""},{"$f":"IF(AD24<>\"OK\",\"\",IF(LoB!AD24=\"Empirical\",IF(OR(LoB!AE24=\"\",ISERROR(MATCH(LoB!AE24,Empirical!$B$1:$CW$1,0))),\"Not Available\",\"OK\"),IF(AND(VLOOKUP(LoB!AD24,List!$A$2:$E$101,2,FALSE)<>\"\",LoB!AE24<=VLOOKUP(LoB!AD24,List!$A$2:$E$101,2,FALSE)),\"Too Small\",IF(AND(VLOOKUP(LoB!AD24,List!$A$2:$E$101,3,FALSE)<>\"\",LoB!AE24>=VLOOKUP(LoB!AD24,List!$A$2:$E$101,3,FALSE)),\"Too Large\",\"OK\"))))","v":""},{"$f":"IF(AD24<>\"OK\",\"\",IF(AND(VLOOKUP(LoB!AD24,List!$A$2:$E$101,4,FALSE)<>\"\",LoB!AF24<=VLOOKUP(LoB!AD24,List!$A$2:$E$101,4,FALSE)),\"Too Small\",IF(AND(VLOOKUP(LoB!AD24,List!$A$2:$E$101,5,FALSE)<>\"\",LoB!AF24>=VLOOKUP(LoB!AD24,List!$A$2:$E$101,5,FALSE)),\"Too Large\",\"OK\")))","v":""},null,{"$f":"IF(AD24<>\"OK\",\"\",IF(AND(LoB!AG24=\"Yes\",LoB!AH24>LoB!AI24),\"Min > Max\",IF(AND(LoB!AG24=\"Yes\",NOT(ISNUMBER(LoB!AH24))),\"Not Number\",\"OK\")))","v":""},{"$f":"IF(AD24<>\"OK\",\"\",IF(AND(LoB!AG24=\"Yes\",LoB!AH24>LoB!AI24),\"Min > Max\",IF(AND(LoB!AG24=\"Yes\",NOT(ISNUMBER(LoB!AI24))),\"Not Number\",\"OK\")))","v":""},{"$f":"IF($E24<>\"Yes\",\"\",IF(ISERROR(MATCH(LoB!AJ24,List!$A$2:$A$101,0)),\"Not Available\",\"OK\"))","v":""},{"$f":"IF(AJ24<>\"OK\",\"\",IF(LoB!AJ24=\"Empirical\",IF(OR(LoB!AK24=\"\",ISERROR(MATCH(LoB!AK24,Empirical!$B$1:$CW$1,0))),\"Not Available\",\"OK\"),IF(AND(VLOOKUP(LoB!AJ24,List!$A$2:$E$101,2,FALSE)<>\"\",LoB!AK24<=VLOOKUP(LoB!AJ24,List!$A$2:$E$101,2,FALSE)),\"Too Small\",IF(AND(VLOOKUP(LoB!AJ24,List!$A$2:$E$101,3,FALSE)<>\"\",LoB!AK24>=VLOOKUP(LoB!AJ24,List!$A$2:$E$101,3,FALSE)),\"Too Large\",\"OK\"))))","v":""},{"$f":"IF(AJ24<>\"OK\",\"\",IF(AND(VLOOKUP(LoB!AJ24,List!$A$2:$E$101,4,FALSE)<>\"\",LoB!AL24<=VLOOKUP(LoB!AJ24,List!$A$2:$E$101,4,FALSE)),\"Too Small\",IF(AND(VLOOKUP(LoB!AJ24,List!$A$2:$E$101,5,FALSE)<>\"\",LoB!AL24>=VLOOKUP(LoB!AJ24,List!$A$2:$E$101,5,FALSE)),\"Too Large\",\"OK\")))","v":""},null,{"$f":"IF(AJ24<>\"OK\",\"\",IF(AND(LoB!AM24=\"Yes\",LoB!AN24>LoB!AO24),\"Min > Max\",IF(AND(LoB!AM24=\"Yes\",NOT(ISNUMBER(LoB!AN24))),\"Not Number\",\"OK\")))","v":""},{"$f":"IF(AJ24<>\"OK\",\"\",IF(AND(LoB!AM24=\"Yes\",LoB!AN24>LoB!AO24),\"Min > Max\",IF(AND(LoB!AM24=\"Yes\",NOT(ISNUMBER(LoB!AO24))),\"Not Number\",\"OK\")))","v":""},{"$f":"IF($E24<>\"Yes\",\"\",IF(ISERROR(MATCH(LoB!AP24,List!$A$2:$A$101,0)),\"Not Available\",\"OK\"))","v":""},{"$f":"IF(AP24<>\"OK\",\"\",IF(LoB!AP24=\"Empirical\",IF(OR(LoB!AQ24=\"\",ISERROR(MATCH(LoB!AQ24,Empirical!$B$1:$CW$1,0))),\"Not Available\",\"OK\"),IF(AND(VLOOKUP(LoB!AP24,List!$A$2:$E$101,2,FALSE)<>\"\",LoB!AQ24<=VLOOKUP(LoB!AP24,List!$A$2:$E$101,2,FALSE)),\"Too Small\",IF(AND(VLOOKUP(LoB!AP24,List!$A$2:$E$101,3,FALSE)<>\"\",LoB!AQ24>=VLOOKUP(LoB!AP24,List!$A$2:$E$101,3,FALSE)),\"Too Large\",\"OK\"))))","v":""},{"$f":"IF(AP24<>\"OK\",\"\",IF(AND(VLOOKUP(LoB!AP24,List!$A$2:$E$101,4,FALSE)<>\"\",LoB!AR24<=VLOOKUP(LoB!AP24,List!$A$2:$E$101,4,FALSE)),\"Too Small\",IF(AND(VLOOKUP(LoB!AP24,List!$A$2:$E$101,5,FALSE)<>\"\",LoB!AR24>=VLOOKUP(LoB!AP24,List!$A$2:$E$101,5,FALSE)),\"Too Large\",\"OK\")))","v":""},null,{"$f":"IF(AP24<>\"OK\",\"\",IF(AND(LoB!AS24=\"Yes\",LoB!AT24>LoB!AU24),\"Min > Max\",IF(AND(LoB!AS24=\"Yes\",NOT(ISNUMBER(LoB!AT24))),\"Not Number\",\"OK\")))","v":""},{"$f":"IF(AP24<>\"OK\",\"\",IF(AND(LoB!AS24=\"Yes\",LoB!AT24>LoB!AU24),\"Min > Max\",IF(AND(LoB!AS24=\"Yes\",NOT(ISNUMBER(LoB!AU24))),\"Not Number\",\"OK\")))","v":""},{"$f":"IF($E24<>\"Yes\",\"\",IF(ISERROR(MATCH(LoB!AV24,List!$F$2:$F$101,0)),\"Not Available\",\"OK\"))","v":""},{"$f":"IF(AV24<>\"OK\",\"\",IF(LoB!AV24=\"Independent\",\"OK\",IF(OR(AND(LoB!AV24=\"clayton\",LoB!AW24<-1),AND(OR(LoB!AV24=\"gumbel\",LoB!AV24=\"joe\"),LoB!AW24<1),AND(LoB!AV24<>\"normal\",LoB!AV24<>\"t\",LoB!AW24=0)),\"Invalid Value\",IF(AND(OR(LoB!AV24=\"normal\",LoB!AV24=\"t\"),ABS(LoB!AW24)>1),\"|Correlation|>1\",IF(AND(OR(LoB!AV24=\"normal\",LoB!AV24=\"t\"),LoB!AW24=\"\"),\"No Value\",\"OK\")))))","v":""},{"$f":"IF(AV24<>\"OK\",\"\",IF(LoB!AV24=\"Independent\",\"OK\", IF(AND(OR(LoB!AV24=\"normal\",LoB!AV24=\"t\"),1-LoB!AW24*LoB!AX24<0),\"Non Positive Semidefinite\",IF(ABS(LoB!AX24)>1,\"|Correlation|>1\",IF(LoB!AX24=\"\",\"No Value\",\"OK\")))))","v":""},{"$f":"IF(AV24<>\"OK\",\"\",IF(AND(OR(LoB!AV24=\"normal\",LoB!AV24=\"t\"),detm(LoB!AW24,LoB!AX24,LoB!AY24)<0),\"Non Positive Semidefinite\",IF(ABS(LoB!AY24)>1,\"|Correlation >1\",IF(LoB!AY24=\"\",\"\",\"OK\"))))","v":""},{"$f":"IF(AV24<>\"OK\",\"\",IF(AND(LoB!AV24=\"t\",LoB!AZ24<=0),\"Wrong DoF\",\"OK\"))","v":""},{"$f":"IF($E24<>\"Yes\",\"\",IF(OR(LoB!BA24=\"\",AND(ISERROR(MATCH(LoB!BA24,FactorTable!$B$1:$GS$1,0)),ISERROR(MATCH(LoB!BA24,Function!$C$1:$CX$1,0)))),\"Not Available\",\"OK\"))","v":""},{"$f":"IF($E24<>\"Yes\",\"\",IF(OR(LoB!BB24=\"Empirical\",LoB!BB24=\"None\",LoB!BB24=\"Fixed\"),\"OK\",\"Wrong\"))","v":""},{"$f":"IF(BB24<>\"OK\",\"\",IF(LoB!BB24=\"Empirical\",IF(OR(LoB!BC24=\"\",ISERROR(MATCH(LoB!BC24,Empirical!$B$1:$CW$1,0))),\"Not Available\",\"OK\"),IF(AND(LoB!BB24=\"Fixed\",LoB!BC24>=0),\"OK\",\"OK\")))","v":""},{"$f":"IF($E24<>\"Yes\",\"\",IF(OR(LoB!BD24=\"Empirical\",LoB!BD24=\"None\",LoB!BB24=\"Fixed\"),\"OK\",\"Wrong\"))","v":""},{"$f":"IF(BD24<>\"OK\",\"\",IF(LoB!BD24=\"Empirical\",IF(OR(LoB!BE24=\"\",ISERROR(MATCH(LoB!BE24,Empirical!$B$1:$CW$1,0))),\"Not Available\",\"OK\"),IF(AND(LoB!BD24=\"Fixed\",LoB!BE24>=0),\"OK\",\"OK\")))","v":""},{"$f":"IF($E24<>\"Yes\",\"\",IF(OR(LoB!BF24=\"\",ISERROR(MATCH(LoB!BF24,List!$M$2:$M$28,0))),\"Not Available\",\"OK\"))","v":""}]
[null,"Correct",{"$f":"IF(LoB!C25=\"\",\"\",LoB!C25)","v":""},{"$f":"IF(LoB!D25=\"\",\"\",LoB!D25)","v":""},{"$f":"IF(LoB!E25=\"\",\"\",LoB!E25)","v":""},{"$f":"IF($E25<>\"Yes\",\"\",IF(OR(LoB!F25=\"CondPaid\",LoB!F25=\"CondIncurLoss\"),\"OK\",IF(OR(AND(ISERROR(MATCH(LoB!F25,FactorTable!$B$1:$GS$1,0)),ISERROR(MATCH(LoB!F25,Function!$C$1:$CX$1,0)))),\"Not Available\",\"OK\")))","v":""},{"$f":"IF($E25<>\"Yes\",\"\",IF(OR(LoB!G25=\"\",AND(ISERROR(MATCH(LoB!G25,FactorTable!$B$1:$GS$1,0)),ISERROR(MATCH(LoB!G25,Function!$C$1:$CX$1,0)))),\"Not Available\",\"OK\"))","v":""},{"$f":"IF($E25<>\"Yes\",\"\",IF(OR(LoB!H25=\"CondPaid\",LoB!H25=\"CondIncurLoss\"),\"OK\",IF(OR(AND(ISERROR(MATCH(LoB!H25,FactorTable!$B$1:$GS$1,0)),ISERROR(MATCH(LoB!H25,Function!$C$1:$CX$1,0)))),\"Not Available\",\"OK\")))","v":""},{"$f":"IF($E25<>\"Yes\",\"\",IF(ISERROR(MATCH(LoB!I25,List!$A$2:$A$101,0)),\"Not Available\",\"OK\"))","v":""},{"$f":"IF(I25<>\"OK\",\"\",IF(LoB!I25=\"Empirical\",IF(OR(LoB!J25=\"\",ISERROR(MATCH(LoB!J25,Empirical!$B$1:$CW$1,0))),\"Not Available\",\"OK\"),IF(AND(VLOOKUP(LoB!I25,List!$A$2:$E$101,2,FALSE)<>\"\",LoB!J25<=VLOOKUP(LoB!I25,List!$A$2:$E$101,2,FALSE)),\"Too Small\",IF(AND(VLOOKUP(LoB!I25,List!$A$2:$E$101,3,FALSE)<>\"\",LoB!J25>=VLOOKUP(LoB!I25,List!$A$2:$E$101,3,FALSE)),\"Too Large\",\"OK\"))))","v":""},{"$f":"IF(I25<>\"OK\",\"\",IF(AND(VLOOKUP(LoB!I25,List!$A$2:$E$101,4,FALSE)<>\"\",LoB!K25<=VLOOKUP(LoB!I25,List!$A$2:$E$101,4,FALSE)),\"Too Small\",IF(AND(VLOOKUP(LoB!I25,List!$A$2:$E$101,5,FALSE)<>\"\",LoB!K25>=VLOOKUP(LoB!I25,List!$A$2:$E$101,5,FALSE)),\"Too Large\",\"OK\")))","v":""},null,{"$f":"IF(I25<>\"OK\",\"\",IF(AND(LoB!L25=\"Yes\",LoB!M25>LoB!N25),\"Min > Max\",IF(AND(LoB!L25=\"Yes\",NOT(ISNUMBER(LoB!M25))),\"Not Number\",\"OK\")))","v":""},{"$f":"IF(I25<>\"OK\",\"\",IF(AND(LoB!L25=\"Yes\",LoB!M25>LoB!N25),\"Min > Max\",IF(AND(LoB!L25=\"Yes\",NOT(ISNUMBER(LoB!N25))),\"Not Number\",\"OK\")))","v":""},{"$f":"IF($E25<>\"Yes\",\"\",IF(ISERROR(MATCH(LoB!O25,List!$A$2:$A$101,0)),\"Not Available\",\"OK\"))","v":""},{"$f":"IF(O25<>\"OK\",\"\",IF(LoB!O25=\"Empirical\",IF(OR(LoB!P25=\"\",ISERROR(MATCH(LoB!P25,Empirical!$B$1:$CW$1,0))),\"Not Available\",\"OK\"),IF(AND(VLOOKUP(LoB!O25,List!$A$2:$E$101,2,FALSE)<>\"\",LoB!P25<=VLOOKUP(LoB!O25,List!$A$2:$E$101,2,FALSE)),\"Too Small\",IF(AND(VLOOKUP(LoB!O25,List!$A$2:$E$101,3,FALSE)<>\"\",LoB!P25>=VLOOKUP(LoB!O25,List!$A$2:$E$101,3,FALSE)),\"Too Large\",\"OK\"))))","v":""},{"$f":"IF(O25<>\"OK\",\"\",IF(AND(VLOOKUP(LoB!O25,List!$A$2:$E$101,4,FALSE)<>\"\",LoB!Q25<=VLOOKUP(LoB!O25,List!$A$2:$E$101,4,FALSE)),\"Too Small\",IF(AND(VLOOKUP(LoB!O25,List!$A$2:$E$101,5,FALSE)<>\"\",LoB!Q25>=VLOOKUP(LoB!O25,List!$A$2:$E$101,5,FALSE)),\"Too Large\",\"OK\")))","v":""},null,{"$f":"IF(O25<>\"OK\",\"\",IF(AND(LoB!R25=\"Yes\",LoB!S25>LoB!T25),\"Min > Max\",IF(AND(LoB!R25=\"Yes\",NOT(ISNUMBER(LoB!S25))),\"Not Number\",\"OK\")))","v":""},{"$f":"IF(O25<>\"OK\",\"\",IF(AND(LoB!R25=\"Yes\",LoB!S25>LoB!T25),\"Min > Max\",IF(AND(LoB!R25=\"Yes\",NOT(ISNUMBER(LoB!T25))),\"Not Number\",\"OK\")))","v":""},{"$f":"IF($E25<>\"Yes\",\"\",IF(OR(LoB!U25=\"\",ISERROR(MATCH(LoB!U25,Index!$B$1:$CW$1,0))),\"Not Available\",\"OK\"))","v":""},{"$f":"IF($E25<>\"Yes\",\"\",IF(ISERROR(MATCH(LoB!V25,List!$A$2:$A$101,0)),\"Not Available\",\"OK\"))","v":""},{"$f":"IF(V25<>\"OK\",\"\",IF(LoB!V25=\"Empirical\",IF(OR(LoB!W25=\"\",ISERROR(MATCH(LoB!W25,Empirical!$B$1:$CW$1,0))),\"Not Available\",\"OK\"),IF(AND(VLOOKUP(LoB!V25,List!$A$2:$E$101,2,FALSE)<>\"\",LoB!W25<=VLOOKUP(LoB!V25,List!$A$2:$E$101,2,FALSE)),\"Too Small\",IF(AND(VLOOKUP(LoB!V25,List!$A$2:$E$101,3,FALSE)<>\"\",LoB!W25>=VLOOKUP(LoB!V25,List!$A$2:$E$101,3,FALSE)),\"Too Large\",\"OK\"))))","v":""},{"$f":"IF(V25<>\"OK\",\"\",IF(AND(VLOOKUP(LoB!V25,List!$A$2:$E$101,4,FALSE)<>\"\",LoB!X25<=VLOOKUP(LoB!V25,List!$A$2:$E$101,4,FALSE)),\"Too Small\",IF(AND(VLOOKUP(LoB!V25,List!$A$2:$E$101,5,FALSE)<>\"\",LoB!X25>=VLOOKUP(LoB!V25,List!$A$2:$E$101,5,FALSE)),\"Too Large\",\"OK\")))","v":""},null,{"$f":"IF(V25<>\"OK\",\"\",IF(AND(LoB!Y25=\"Yes\",LoB!Z25>LoB!AA25),\"Min > Max\",IF(AND(LoB!Y25=\"Yes\",NOT(ISNUMBER(LoB!Z25))),\"Not Number\",\"OK\")))","v":""},{"$f":"IF(V25<>\"OK\",\"\",IF(AND(LoB!Y25=\"Yes\",LoB!Z25>LoB!AA25),\"Min > Max\",IF(AND(LoB!Y25=\"Yes\",NOT(ISNUMBER(LoB!AA25))),\"Not Number\",\"OK\")))","v":""},{"$f":"IF($E25<>\"Yes\",\"\",IF(OR(LoB!AB25=\"\",ISERROR(MATCH(LoB!AB25,Index!$B$1:$CW$1,0))),\"Not Available\",\"OK\"))","v":""},{"$f":"IF($E25<>\"Yes\",\"\",IF(OR(LoB!AC25=\"CLOSED\",LoB!AC25=\"ALL\"),\"OK\",\"Not Available\"))","v":""},{"$f":"IF($E25<>\"Yes\",\"\",IF(ISERROR(MATCH(LoB!AD25,List!$A$2:$A$101,0)),\"Not Available\",\"OK\"))","v":""},{"$f":"IF(AD25<>\"OK\",\"\",IF(LoB!AD25=\"Empirical\",IF(OR(LoB!AE25=\"\",ISERROR(MATCH(LoB!AE25,Empirical!$B$1:$CW$1,0))),\"Not Available\",\"OK\"),IF(AND(VLOOKUP(LoB!AD25,List!$A$2:$E$101,2,FALSE)<>\"\",LoB!AE25<=VLOOKUP(LoB!AD25,List!$A$2:$E$101,2,FALSE)),\"Too Small\",IF(AND(VLOOKUP(LoB!AD25,List!$A$2:$E$101,3,FALSE)<>\"\",LoB!AE25>=VLOOKUP(LoB!AD25,List!$A$2:$E$101,3,FALSE)),\"Too Large\",\"OK\"))))","v":""},{"$f":"IF(AD25<>\"OK\",\"\",IF(AND(VLOOKUP(LoB!AD25,List!$A$2:$E$101,4,FALSE)<>\"\",LoB!AF25<=VLOOKUP(LoB!AD25,List!$A$2:$E$101,4,FALSE)),\"Too Small\",IF(AND(VLOOKUP(LoB!AD25,List!$A$2:$E$101,5,FALSE)<>\"\",LoB!AF25>=VLOOKUP(LoB!AD25,List!$A$2:$E$101,5,FALSE)),\"Too Large\",\"OK\")))","v":""},null,{"$f":"IF(AD25<>\"OK\",\"\",IF(AND(LoB!AG25=\"Yes\",LoB!AH25>LoB!AI25),\"Min > Max\",IF(AND(LoB!AG25=\"Yes\",NOT(ISNUMBER(LoB!AH25))),\"Not Number\",\"OK\")))","v":""},{"$f":"IF(AD25<>\"OK\",\"\",IF(AND(LoB!AG25=\"Yes\",LoB!AH25>LoB!AI25),\"Min > Max\",IF(AND(LoB!AG25=\"Yes\",NOT(ISNUMBER(LoB!AI25))),\"Not Number\",\"OK\")))","v":""},{"$f":"IF($E25<>\"Yes\",\"\",IF(ISERROR(MATCH(LoB!AJ25,List!$A$2:$A$101,0)),\"Not Available\",\"OK\"))","v":""},{"$f":"IF(AJ25<>\"OK\",\"\",IF(LoB!AJ25=\"Empirical\",IF(OR(LoB!AK25=\"\",ISERROR(MATCH(LoB!AK25,Empirical!$B$1:$CW$1,0))),\"Not Available\",\"OK\"),IF(AND(VLOOKUP(LoB!AJ25,List!$A$2:$E$101,2,FALSE)<>\"\",LoB!AK25<=VLOOKUP(LoB!AJ25,List!$A$2:$E$101,2,FALSE)),\"Too Small\",IF(AND(VLOOKUP(LoB!AJ25,List!$A$2:$E$101,3,FALSE)<>\"\",LoB!AK25>=VLOOKUP(LoB!AJ25,List!$A$2:$E$101,3,FALSE)),\"Too Large\",\"OK\"))))","v":""},{"$f":"IF(AJ25<>\"OK\",\"\",IF(AND(VLOOKUP(LoB!AJ25,List!$A$2:$E$101,4,FALSE)<>\"\",LoB!AL25<=VLOOKUP(LoB!AJ25,List!$A$2:$E$101,4,FALSE)),\"Too Small\",IF(AND(VLOOKUP(LoB!AJ25,List!$A$2:$E$101,5,FALSE)<>\"\",LoB!AL25>=VLOOKUP(LoB!AJ25,List!$A$2:$E$101,5,FALSE)),\"Too Large\",\"OK\")))","v":""},null,{"$f":"IF(AJ25<>\"OK\",\"\",IF(AND(LoB!AM25=\"Yes\",LoB!AN25>LoB!AO25),\"Min > Max\",IF(AND(LoB!AM25=\"Yes\",NOT(ISNUMBER(LoB!AN25))),\"Not Number\",\"OK\")))","v":""},{"$f":"IF(AJ25<>\"OK\",\"\",IF(AND(LoB!AM25=\"Yes\",LoB!AN25>LoB!AO25),\"Min > Max\",IF(AND(LoB!AM25=\"Yes\",NOT(ISNUMBER(LoB!AO25))),\"Not Number\",\"OK\")))","v":""},{"$f":"IF($E25<>\"Yes\",\"\",IF(ISERROR(MATCH(LoB!AP25,List!$A$2:$A$101,0)),\"Not Available\",\"OK\"))","v":""},{"$f":"IF(AP25<>\"OK\",\"\",IF(LoB!AP25=\"Empirical\",IF(OR(LoB!AQ25=\"\",ISERROR(MATCH(LoB!AQ25,Empirical!$B$1:$CW$1,0))),\"Not Available\",\"OK\"),IF(AND(VLOOKUP(LoB!AP25,List!$A$2:$E$101,2,FALSE)<>\"\",LoB!AQ25<=VLOOKUP(LoB!AP25,List!$A$2:$E$101,2,FALSE)),\"Too Small\",IF(AND(VLOOKUP(LoB!AP25,List!$A$2:$E$101,3,FALSE)<>\"\",LoB!AQ25>=VLOOKUP(LoB!AP25,List!$A$2:$E$101,3,FALSE)),\"Too Large\",\"OK\"))))","v":""},{"$f":"IF(AP25<>\"OK\",\"\",IF(AND(VLOOKUP(LoB!AP25,List!$A$2:$E$101,4,FALSE)<>\"\",LoB!AR25<=VLOOKUP(LoB!AP25,List!$A$2:$E$101,4,FALSE)),\"Too Small\",IF(AND(VLOOKUP(LoB!AP25,List!$A$2:$E$101,5,FALSE)<>\"\",LoB!AR25>=VLOOKUP(LoB!AP25,List!$A$2:$E$101,5,FALSE)),\"Too Large\",\"OK\")))","v":""},null,{"$f":"IF(AP25<>\"OK\",\"\",IF(AND(LoB!AS25=\"Yes\",LoB!AT25>LoB!AU25),\"Min > Max\",IF(AND(LoB!AS25=\"Yes\",NOT(ISNUMBER(LoB!AT25))),\"Not Number\",\"OK\")))","v":""},{"$f":"IF(AP25<>\"OK\",\"\",IF(AND(LoB!AS25=\"Yes\",LoB!AT25>LoB!AU25),\"Min > Max\",IF(AND(LoB!AS25=\"Yes\",NOT(ISNUMBER(LoB!AU25))),\"Not Number\",\"OK\")))","v":""},{"$f":"IF($E25<>\"Yes\",\"\",IF(ISERROR(MATCH(LoB!AV25,List!$F$2:$F$101,0)),\"Not Available\",\"OK\"))","v":""},{"$f":"IF(AV25<>\"OK\",\"\",IF(LoB!AV25=\"Independent\",\"OK\",IF(OR(AND(LoB!AV25=\"clayton\",LoB!AW25<-1),AND(OR(LoB!AV25=\"gumbel\",LoB!AV25=\"joe\"),LoB!AW25<1),AND(LoB!AV25<>\"normal\",LoB!AV25<>\"t\",LoB!AW25=0)),\"Invalid Value\",IF(AND(OR(LoB!AV25=\"normal\",LoB!AV25=\"t\"),ABS(LoB!AW25)>1),\"|Correlation|>1\",IF(AND(OR(LoB!AV25=\"normal\",LoB!AV25=\"t\"),LoB!AW25=\"\"),\"No Value\",\"OK\")))))","v":""},{"$f":"IF(AV25<>\"OK\",\"\",IF(LoB!AV25=\"Independent\",\"OK\", IF(AND(OR(LoB!AV25=\"normal\",LoB!AV25=\"t\"),1-LoB!AW25*LoB!AX25<0),\"Non Positive Semidefinite\",IF(ABS(LoB!AX25)>1,\"|Correlation|>1\",IF(LoB!AX25=\"\",\"No Value\",\"OK\")))))","v":""},{"$f":"IF(AV25<>\"OK\",\"\",IF(AND(OR(LoB!AV25=\"normal\",LoB!AV25=\"t\"),detm(LoB!AW25,LoB!AX25,LoB!AY25)<0),\"Non Positive Semidefinite\",IF(ABS(LoB!AY25)>1,\"|Correlation >1\",IF(LoB!AY25=\"\",\"\",\"OK\"))))","v":""},{"$f":"IF(AV25<>\"OK\",\"\",IF(AND(LoB!AV25=\"t\",LoB!AZ25<=0),\"Wrong DoF\",\"OK\"))","v":""},{"$f":"IF($E25<>\"Yes\",\"\",IF(OR(LoB!BA25=\"\",AND(ISERROR(MATCH(LoB!BA25,FactorTable!$B$1:$GS$1,0)),ISERROR(MATCH(LoB!BA25,Function!$C$1:$CX$1,0)))),\"Not Available\",\"OK\"))","v":""},{"$f":"IF($E25<>\"Yes\",\"\",IF(OR(LoB!BB25=\"Empirical\",LoB!BB25=\"None\",LoB!BB25=\"Fixed\"),\"OK\",\"Wrong\"))","v":""},{"$f":"IF(BB25<>\"OK\",\"\",IF(LoB!BB25=\"Empirical\",IF(OR(LoB!BC25=\"\",ISERROR(MATCH(LoB!BC25,Empirical!$B$1:$CW$1,0))),\"Not Available\",\"OK\"),IF(AND(LoB!BB25=\"Fixed\",LoB!BC25>=0),\"OK\",\"OK\")))","v":""},{"$f":"IF($E25<>\"Yes\",\"\",IF(OR(LoB!BD25=\"Empirical\",LoB!BD25=\"None\",LoB!BB25=\"Fixed\"),\"OK\",\"Wrong\"))","v":""},{"$f":"IF(BD25<>\"OK\",\"\",IF(LoB!BD25=\"Empirical\",IF(OR(LoB!BE25=\"\",ISERROR(MATCH(LoB!BE25,Empirical!$B$1:$CW$1,0))),\"Not Available\",\"OK\"),IF(AND(LoB!BD25=\"Fixed\",LoB!BE25>=0),\"OK\",\"OK\")))","v":""},{"$f":"IF($E25<>\"Yes\",\"\",IF(OR(LoB!BF25=\"\",ISERROR(MATCH(LoB!BF25,List!$M$2:$M$28,0))),\"Not Available\",\"OK\"))","v":""}]

{"sheet":"FreqCopula","index":5,"n_rows":26,"n_cols":28,"rows_kept":26,"cut":false,"hidden":false,"merged":[[1,12,2,12],[2,3,2,5],[3,3,3,5],[1,9,2,9],[1,10,2,10],[1,11,2,11]]}
[null,null,"Individual Claim Simulator API - Claim Data Setup"]
[null,null,null,null,null,null,null,null,null,"Diagonal Check","Non-Diagonal Check","Positive Semi-Definite Check","Business Line Check"]
[null,null,"Copula",{"$f":"IF(OR(C4=\"Normal\",C4=\"t\"),\"Set Parameters in the Matrix from Row 7\",IF(C4=\"Independent\",\"\",\"Parameter\"))","v":"Set Parameters in the Matrix from Row 7"},null,null,{"$f":"IF(C4=\"t\",\"degree of freedom\",\"NA\")","v":"NA"},"Validation"]
[null,null,"normal",null,null,null,3,{"$f":"IF(C4=\"Independent\",\"Correct\", IF(C4=\"normal\",IF(AND(J4,K4,L4,M4),\"Correct\",\"Wrong\"),IF(C4=\"t\",IF(AND(J4,K4,L4,M4,G4>0),\"Correct\",\"Wrong\"),IF(C4=\"Independent\",\"Correct\",IF(OR(AND(freqC=\"clayton\",D4>=-1,D4<>0),AND(freqC=\"frank\",D4<>0),AND(OR(freqC=\"gumbel\",freqC=\"joe\"),D4>=1)),\"Correct\",\"Wrong\")))))","v":"Correct"},null,{"$f":"IF(COUNTIF(X7:X26,FALSE)=0,TRUE,FALSE)","v":true},{"$f":"IF(SUM(Y7:Y26)=0,TRUE,FALSE)","v":true},{"$f":"IF(ISERROR(MIN(Z7:Z26)<0),FALSE,IF(MIN(Z7:Z26)<0,FALSE,TRUE))","v":true},{"$f":"IF(COUNTIFS(AA7:AA26,\"<>OK\",AA7:AA26,\">\"\"\")=0,TRUE,FALSE)","v":true}]
[]
[null,null,"Correlation",{"$f":"IF(TRANSPOSE(C7:C26)=\"\",\"\",TRANSPOSE(C7:C26))","v":"Home"},"Auto","","","","","","","","","","","","","","","","","","","Diagonal Check","Non-Diagonal Check","Positive Semi-Definite Check","Business Line Check"]
[null,null,"Home",{"$f":"IF($C7<>\"\",1,\"\")","v":1},{"$f":"IF(E$6:W$6=\"\",\"\",TRANSPOSE(D8:D26))","v":-0.19750000000000001},"","","","","","","","","","","","","","","","","","",{"$f":"IF(C7<>\"\",OFFSET($D$7,AB7-1,AB7-1)=1,\"\")","v":true},{"$f":"IF(C7<>\"\",COUNTIFS(D7:W7,\">1\",D7:W7,\"<-1\"),\"\")","v":0},{"$f":"IF(C7<>\"\",MDETERM(OFFSET($D$7,0,0,ROWS($Z$7:$Z7),ROWS($Z$7:$Z7))),\"\")","v":1},{"$f":"IF(AND(OR(freqC=\"normal\",freqC=\"t\"),LoB!E6=\"Yes\",ISERROR(MATCH(LoB!C6,lineList,0))),\"Business Line \"&LoB!C6&\" is not in the correlation matrix\",IF(AND(C7<>\"\",NOT(ISERROR(MATCH(C7,C8:C$26,0)))),\"Business Line \"&C7&\" is not unique in the correlation matrix\",\"OK\"))","v":"OK"},1]
[null,null,"Auto",-0.19750000000000001,{"$f":"IF($C8<>\"\",1,\"\")","v":1},{"$f":"IF(F$6:X$6=\"\",\"\",TRANSPOSE(E9:E27))","v":""},"","","","","","","","","","","","","","","","","",{"$f":"IF(C8<>\"\",OFFSET($D$7,AB8-1,AB8-1)=1,\"\")","v":true},{"$f":"IF(C8<>\"\",COUNTIFS(D8:W8,\">1\",D8:W8,\"<-1\"),\"\")","v":0},{"$f":"IF(C8<>\"\",MDETERM(OFFSET($D$7,0,0,ROWS($Z$7:$Z8),ROWS($Z$7:$Z8))),\"\")","v":0.96099374999999998},{"$f":"IF(AND(OR(freqC=\"normal\",freqC=\"t\"),LoB!E7=\"Yes\",ISERROR(MATCH(LoB!C7,lineList,0))),\"Business Line \"&LoB!C7&\" is not in the correlation matrix\",IF(AND(C8<>\"\",NOT(ISERROR(MATCH(C8,C9:C$26,0)))),\"Business Line \"&C8&\" is not unique in the correlation matrix\",\"OK\"))","v":"OK"},2]
[null,null,null,null,null,{"$f":"IF($C9<>\"\",1,\"\")","v":""},{"$f":"IF(G$6:Y$6=\"\",\"\",TRANSPOSE(F10:F28))","v":""},"","","","","","","","","","","","","","","","",{"$f":"IF(C9<>\"\",OFFSET($D$7,AB9-1,AB9-1)=1,\"\")","v":""},{"$f":"IF(C9<>\"\",COUNTIFS(D9:W9,\">1\",D9:W9,\"<-1\"),\"\")","v":""},{"$f":"IF(C9<>\"\",MDETERM(OFFSET($D$7,0,0,ROWS($Z$7:$Z9),ROWS($Z$7:$Z9))),\"\")","v":""},{"$f":"IF(AND(OR(freqC=\"normal\",freqC=\"t\"),LoB!E8=\"Yes\",ISERROR(MATCH(LoB!C8,lineList,0))),\"Business Line \"&LoB!C8&\" is not in the correlation matrix\",IF(AND(C9<>\"\",NOT(ISERROR(MATCH(C9,C10:C$26,0)))),\"Business Line \"&C9&\" is not unique in the correlation matrix\",\"OK\"))","v":"OK"},3]
[null,null,null,null,null,null,{"$f":"IF($C10<>\"\",1,\"\")","v":""},{"$f":"IF(H$6:Z$6=\"\",\"\",TRANSPOSE(G11:G29))","v":""},"","","","","","","","","","","","","","","",{"$f":"IF(C10<>\"\",OFFSET($D$7,AB10-1,AB10-1)=1,\"\")","v":""},{"$f":"IF(C10<>\"\",COUNTIFS(D10:W10,\">1\",D10:W10,\"<-1\"),\"\")","v":""},{"$f":"IF(C10<>\"\",MDETERM(OFFSET($D$7,0,0,ROWS($Z$7:$Z10),ROWS($Z$7:$Z10))),\"\")","v":""},{"$f":"IF(AND(OR(freqC=\"normal\",freqC=\"t\"),LoB!E9=\"Yes\",ISERROR(MATCH(LoB!C9,lineList,0))),\"Business Line \"&LoB!C9&\" is not in the correlation matrix\",IF(AND(C10<>\"\",NOT(ISERROR(MATCH(C10,C11:C$26,0)))),\"Business Line \"&C10&\" is not unique in the correlation matrix\",\"OK\"))","v":"OK"},4]
[null,null,null,null,null,null,null,{"$f":"IF($C11<>\"\",1,\"\")","v":""},{"$f":"IF(I$6:AB$6=\"\",\"\",TRANSPOSE(H12:H30))","v":""},"","","","","","","","","","","","","","","","",{"$f":"IF(C11<>\"\",MDETERM(OFFSET($D$7,0,0,ROWS($Z$7:$Z11),ROWS($Z$7:$Z11))),\"\")","v":""},{"$f":"IF(AND(OR(freqC=\"normal\",freqC=\"t\"),LoB!E10=\"Yes\",ISERROR(MATCH(LoB!C10,lineList,0))),\"Business Line \"&LoB!C10&\" is not in the correlation matrix\",IF(AND(C11<>\"\",NOT(ISERROR(MATCH(C11,C12:C$26,0)))),\"Business Line \"&C11&\" is not unique in the correlation matrix\",\"OK\"))","v":"OK"},5]
[null,null,null,null,null,null,null,null,{"$f":"IF($C12<>\"\",1,\"\")","v":""},{"$f":"IF(J$6:AC$6=\"\",\"\",TRANSPOSE(I13:I31))","v":""},"","","","","","","","","","","","","","","",{"$f":"IF(C12<>\"\",MDETERM(OFFSET($D$7,0,0,ROWS($Z$7:$Z12),ROWS($Z$7:$Z12))),\"\")","v":""},{"$f":"IF(AND(OR(freqC=\"normal\",freqC=\"t\"),LoB!E11=\"Yes\",ISERROR(MATCH(LoB!C11,lineList,0))),\"Business Line \"&LoB!C11&\" is not in the correlation matrix\",IF(AND(C12<>\"\",NOT(ISERROR(MATCH(C12,C13:C$26,0)))),\"Business Line \"&C12&\" is not unique in the correlation matrix\",\"OK\"))","v":"OK"},6]
[null,null,null,null,null,null,null,null,null,{"$f":"IF($C13<>\"\",1,\"\")","v":""},{"$f":"IF(K$6:AD$6=\"\",\"\",TRANSPOSE(J14:J32))","v":""},"","","","","","","","","","","","","","",{"$f":"IF(C13<>\"\",MDETERM(OFFSET($D$7,0,0,ROWS($Z$7:$Z13),ROWS($Z$7:$Z13))),\"\")","v":""},{"$f":"IF(AND(OR(freqC=\"normal\",freqC=\"t\"),LoB!E12=\"Yes\",ISERROR(MATCH(LoB!C12,lineList,0))),\"Business Line \"&LoB!C12&\" is not in the correlation matrix\",IF(AND(C13<>\"\",NOT(ISERROR(MATCH(C13,C14:C$26,0)))),\"Business Line \"&C13&\" is not unique in the correlation matrix\",\"OK\"))","v":"OK"},7]
[null,null,null,null,null,null,null,null,null,null,{"$f":"IF($C14<>\"\",1,\"\")","v":""},{"$f":"IF(L$6:AE$6=\"\",\"\",TRANSPOSE(K15:K33))","v":""},"","","","","","","","","","","","","",{"$f":"IF(C14<>\"\",MDETERM(OFFSET($D$7,0,0,ROWS($Z$7:$Z14),ROWS($Z$7:$Z14))),\"\")","v":""},{"$f":"IF(AND(OR(freqC=\"normal\",freqC=\"t\"),LoB!E13=\"Yes\",ISERROR(MATCH(LoB!C13,lineList,0))),\"Business Line \"&LoB!C13&\" is not in the correlation matrix\",IF(AND(C14<>\"\",NOT(ISERROR(MATCH(C14,C15:C$26,0)))),\"Business Line \"&C14&\" is not unique in the correlation matrix\",\"OK\"))","v":"OK"},8]
[null,null,null,null,null,null,null,null,null,null,null,{"$f":"IF($C15<>\"\",1,\"\")","v":""},{"$f":"IF(M$6:AF$6=\"\",\"\",TRANSPOSE(L16:L34))","v":""},"","","","","","","","","","","","",{"$f":"IF(C15<>\"\",MDETERM(OFFSET($D$7,0,0,ROWS($Z$7:$Z15),ROWS($Z$7:$Z15))),\"\")","v":""},{"$f":"IF(AND(OR(freqC=\"normal\",freqC=\"t\"),LoB!E14=\"Yes\",ISERROR(MATCH(LoB!C14,lineList,0))),\"Business Line \"&LoB!C14&\" is not in the correlation matrix\",IF(AND(C15<>\"\",NOT(ISERROR(MATCH(C15,C16:C$26,0)))),\"Business Line \"&C15&\" is not unique in the correlation matrix\",\"OK\"))","v":"OK"},9]
[null,null,null,null,null,null,null,null,null,null,null,null,{"$f":"IF($C16<>\"\",1,\"\")","v":""},{"$f":"IF(N$6:AG$6=\"\",\"\",TRANSPOSE(M17:M35))","v":""},"","","","","","","","","","","",{"$f":"IF(C16<>\"\",MDETERM(OFFSET($D$7,0,0,ROWS($Z$7:$Z16),ROWS($Z$7:$Z16))),\"\")","v":""},{"$f":"IF(AND(OR(freqC=\"normal\",freqC=\"t\"),LoB!E15=\"Yes\",ISERROR(MATCH(LoB!C15,lineList,0))),\"Business Line \"&LoB!C15&\" is not in the correlation matrix\",IF(AND(C16<>\"\",NOT(ISERROR(MATCH(C16,C17:C$26,0)))),\"Business Line \"&C16&\" is not unique in the correlation matrix\",\"OK\"))","v":"OK"},10]
[null,null,null,null,null,null,null,null,null,null,null,null,null,{"$f":"IF($C17<>\"\",1,\"\")","v":""},{"$f":"IF(O$6:AH$6=\"\",\"\",TRANSPOSE(N18:N36))","v":""},"","","","","","","","","","",{"$f":"IF(C17<>\"\",MDETERM(OFFSET($D$7,0,0,ROWS($Z$7:$Z17),ROWS($Z$7:$Z17))),\"\")","v":""},{"$f":"IF(AND(OR(freqC=\"normal\",freqC=\"t\"),LoB!E16=\"Yes\",ISERROR(MATCH(LoB!C16,lineList,0))),\"Business Line \"&LoB!C16&\" is not in the correlation matrix\",IF(AND(C17<>\"\",NOT(ISERROR(MATCH(C17,C18:C$26,0)))),\"Business Line \"&C17&\" is not unique in the correlation matrix\",\"OK\"))","v":"OK"},11]
[null,null,null,null,null,null,null,null,null,null,null,null,null,null,{"$f":"IF($C18<>\"\",1,\"\")","v":""},{"$f":"IF(P$6:AI$6=\"\",\"\",TRANSPOSE(O19:O37))","v":""},"","","","","","","","","",{"$f":"IF(C18<>\"\",MDETERM(OFFSET($D$7,0,0,ROWS($Z$7:$Z18),ROWS($Z$7:$Z18))),\"\")","v":""},{"$f":"IF(AND(OR(freqC=\"normal\",freqC=\"t\"),LoB!E17=\"Yes\",ISERROR(MATCH(LoB!C17,lineList,0))),\"Business Line \"&LoB!C17&\" is not in the correlation matrix\",IF(AND(C18<>\"\",NOT(ISERROR(MATCH(C18,C19:C$26,0)))),\"Business Line \"&C18&\" is not unique in the correlation matrix\",\"OK\"))","v":"OK"},12]
[null,null,null,null,null,null,null,null,null,null,null,null,null,null,null,{"$f":"IF($C19<>\"\",1,\"\")","v":""},{"$f":"IF(Q$6:AJ$6=\"\",\"\",TRANSPOSE(P20:P38))","v":""},"","","","","","","","",{"$f":"IF(C19<>\"\",MDETERM(OFFSET($D$7,0,0,ROWS($Z$7:$Z19),ROWS($Z$7:$Z19))),\"\")","v":""},{"$f":"IF(AND(OR(freqC=\"normal\",freqC=\"t\"),LoB!E18=\"Yes\",ISERROR(MATCH(LoB!C18,lineList,0))),\"Business Line \"&LoB!C18&\" is not in the correlation matrix\",IF(AND(C19<>\"\",NOT(ISERROR(MATCH(C19,C20:C$26,0)))),\"Business Line \"&C19&\" is not unique in the correlation matrix\",\"OK\"))","v":"OK"},13]
[null,null,null,null,null,null,null,null,null,null,null,null,null,null,null,null,{"$f":"IF($C20<>\"\",1,\"\")","v":""},{"$f":"IF(R$6:AK$6=\"\",\"\",TRANSPOSE(Q21:Q39))","v":""},"","","","","","","",{"$f":"IF(C20<>\"\",MDETERM(OFFSET($D$7,0,0,ROWS($Z$7:$Z20),ROWS($Z$7:$Z20))),\"\")","v":""},{"$f":"IF(AND(OR(freqC=\"normal\",freqC=\"t\"),LoB!E19=\"Yes\",ISERROR(MATCH(LoB!C19,lineList,0))),\"Business Line \"&LoB!C19&\" is not in the correlation matrix\",IF(AND(C20<>\"\",NOT(ISERROR(MATCH(C20,C21:C$26,0)))),\"Business Line \"&C20&\" is not unique in the correlation matrix\",\"OK\"))","v":"OK"},14]
[null,null,null,null,null,null,null,null,null,null,null,null,null,null,null,null,null,{"$f":"IF($C21<>\"\",1,\"\")","v":""},{"$f":"IF(S$6:AL$6=\"\",\"\",TRANSPOSE(R22:R40))","v":""},"","","","","","",{"$f":"IF(C21<>\"\",MDETERM(OFFSET($D$7,0,0,ROWS($Z$7:$Z21),ROWS($Z$7:$Z21))),\"\")","v":""},{"$f":"IF(AND(OR(freqC=\"normal\",freqC=\"t\"),LoB!E20=\"Yes\",ISERROR(MATCH(LoB!C20,lineList,0))),\"Business Line \"&LoB!C20&\" is not in the correlation matrix\",IF(AND(C21<>\"\",NOT(ISERROR(MATCH(C21,C22:C$26,0)))),\"Business Line \"&C21&\" is not unique in the correlation matrix\",\"OK\"))","v":"OK"},15]
[null,null,null,null,null,null,null,null,null,null,null,null,null,null,null,null,null,null,{"$f":"IF($C22<>\"\",1,\"\")","v":""},{"$f":"IF(T$6:AM$6=\"\",\"\",TRANSPOSE(S23:S41))","v":""},"","","","","",{"$f":"IF(C22<>\"\",MDETERM(OFFSET($D$7,0,0,ROWS($Z$7:$Z22),ROWS($Z$7:$Z22))),\"\")","v":""},{"$f":"IF(AND(OR(freqC=\"normal\",freqC=\"t\"),LoB!E21=\"Yes\",ISERROR(MATCH(LoB!C21,lineList,0))),\"Business Line \"&LoB!C21&\" is not in the correlation matrix\",IF(AND(C22<>\"\",NOT(ISERROR(MATCH(C22,C23:C$26,0)))),\"Business Line \"&C22&\" is not unique in the correlation matrix\",\"OK\"))","v":"OK"},16]
[null,null,null,null,null,null,null,null,null,null,null,null,null,null,null,null,null,null,null,{"$f":"IF($C23<>\"\",1,\"\")","v":""},{"$f":"IF(U$6:AN$6=\"\",\"\",TRANSPOSE(T24:T42))","v":""},"","","","",{"$f":"IF(C23<>\"\",MDETERM(OFFSET($D$7,0,0,ROWS($Z$7:$Z23),ROWS($Z$7:$Z23))),\"\")","v":""},{"$f":"IF(AND(OR(freqC=\"normal\",freqC=\"t\"),LoB!E22=\"Yes\",ISERROR(MATCH(LoB!C22,lineList,0))),\"Business Line \"&LoB!C22&\" is not in the correlation matrix\",IF(AND(C23<>\"\",NOT(ISERROR(MATCH(C23,C24:C$26,0)))),\"Business Line \"&C23&\" is not unique in the correlation matrix\",\"OK\"))","v":"OK"},17]
[null,null,null,null,null,null,null,null,null,null,null,null,null,null,null,null,null,null,null,null,{"$f":"IF($C24<>\"\",1,\"\")","v":""},{"$f":"IF(V$6:AO$6=\"\",\"\",TRANSPOSE(U25:U43))","v":""},"","","",{"$f":"IF(C24<>\"\",MDETERM(OFFSET($D$7,0,0,ROWS($Z$7:$Z24),ROWS($Z$7:$Z24))),\"\")","v":""},{"$f":"IF(AND(OR(freqC=\"normal\",freqC=\"t\"),LoB!E23=\"Yes\",ISERROR(MATCH(LoB!C23,lineList,0))),\"Business Line \"&LoB!C23&\" is not in the correlation matrix\",IF(AND(C24<>\"\",NOT(ISERROR(MATCH(C24,C25:C$26,0)))),\"Business Line \"&C24&\" is not unique in the correlation matrix\",\"OK\"))","v":"OK"},18]
[null,null,null,null,null,null,null,null,null,null,null,null,null,null,null,null,null,null,null,null,null,{"$f":"IF($C25<>\"\",1,\"\")","v":""},{"$f":"IF(W$6:AP$6=\"\",\"\",TRANSPOSE(V26:V44))","v":""},"","",{"$f":"IF(C25<>\"\",MDETERM(OFFSET($D$7,0,0,ROWS($Z$7:$Z25),ROWS($Z$7:$Z25))),\"\")","v":""},{"$f":"IF(AND(OR(freqC=\"normal\",freqC=\"t\"),LoB!E24=\"Yes\",ISERROR(MATCH(LoB!C24,lineList,0))),\"Business Line \"&LoB!C24&\" is not in the correlation matrix\",IF(AND(C25<>\"\",NOT(ISERROR(MATCH(C25,C26:C$26,0)))),\"Business Line \"&C25&\" is not unique in the correlation matrix\",\"OK\"))","v":"OK"},19]
[null,null,null,null,null,null,null,null,null,null,null,null,null,null,null,null,null,null,null,null,null,null,{"$f":"IF($C26<>\"\",1,\"\")","v":""},"","",{"$f":"IF(C26<>\"\",MDETERM(OFFSET($D$7,0,0,ROWS($Z$7:$Z26),ROWS($Z$7:$Z26))),\"\")","v":""},{"$f":"IF(AND(OR(freqC=\"normal\",freqC=\"t\"),LoB!E25=\"Yes\",ISERROR(MATCH(LoB!C25,lineList,0))),\"Business Line \"&LoB!C25&\" is not in the correlation matrix\",IF(AND(C26<>\"\",NOT(ISERROR(MATCH(C26,C$26:C27,0)))),\"Business Line \"&C26&\" is not unique in the correlation matrix\",\"OK\"))","v":"OK"},20]

{"sheet":"Function","index":6,"n_rows":110,"n_cols":201,"rows_kept":110,"cut":false,"hidden":false,"merged":[]}
["ID","Included","ZeroFunc","F1","F2","F3"]
["Link Function",null,"identity","identity","exponential","log"]
["Intercept","Yes",0,5,1.05,1E-3]
["Development Year","Yes",0,0.01,0,0.01]
["Incurred Loss","Yes",0,5.0000000000000001E-3,0,0]
["O/S Ratio","Yes",0,2E-3,0,0]
["Volatility","Yes",0,5,0.01,8.0000000000000002E-3]
["reportedCount","No",0,0,0,0]
["x2","No",0]
["x3","No",0]
["x4","No",0]
["x5","No",0]
["x6","No",0]
["x7","No",0]
["x8","No",0]
["x9","No",0]
["x10","No",0]
["x11","No",0]
["x12","No",0]
["x13","No",0]
["x14","No",0]
["x15","No",0]
["x16","No",0]
["x17","No",0]
["x18","No",0]
["x19","No",0]
["x20","No",0]
["x21","No",0]
["x22","No",0]
["x23","No",0]
["x24","No",0]
["x25","No",0]
["x26","No",0]
["x27","No",0]
["x28","No",0]
["x29","No",0]
["x30","No",0]
[]
[]
[]
[]
[]
[]
[]
[]
[]
[]
[]
[]
[]
[]
[]
[]
[]
[]
[]
[]
[]
[]
[]
[]
[]
[]
[]
[]
[]
[]
[]
[]
[]
[]
[]
[]
[]
[]
[]
[]
[]
[]
[]
[]
[]
[]
[]
[]
[]
[]
[]
[]
[]
[]
[]
[]
[]
[]
[]
[]
[]
[]
[]
[]
[]
[]
[]
[]
[]
[]
[]
[]
["Intrim Step  DO NOT CHANGE",null,{"$f":"IF(C1<>\"\",MAX($A110:B110)+1,\"\")","v":1},{"$f":"IF(D1<>\"\",MAX($A110:C110)+1,\"\")","v":2},{"$f":"IF(E1<>\"\",MAX($A110:D110)+1,\"\")","v":3},{"$f":"IF(F1<>\"\",MAX($A110:E110)+1,\"\")","v":4},{"$f":"IF(G1<>\"\",MAX($A110:F110)+1,\"\")","v":""},{"$f":"IF(H1<>\"\",MAX($A110:G110)+1,\"\")","v":""},{"$f":"IF(I1<>\"\",MAX($A110:H110)+1,\"\")","v":""},{"$f":"IF(J1<>\"\",MAX($A110:I110)+1,\"\")","v":""},{"$f":"IF(K1<>\"\",MAX($A110:J110)+1,\"\")","v":""},{"$f":"IF(L1<>\"\",MAX($A110:K110)+1,\"\")","v":""},{"$f":"IF(M1<>\"\",MAX($A110:L110)+1,\"\")","v":""},{"$f":"IF(N1<>\"\",MAX($A110:M110)+1,\"\")","v":""},{"$f":"IF(O1<>\"\",MAX($A110:N110)+1,\"\")","v":""},{"$f":"IF(P1<>\"\",MAX($A110:O110)+1,\"\")","v":""},{"$f":"IF(Q1<>\"\",MAX($A110:P110)+1,\"\")","v":""},{"$f":"IF(R1<>\"\",MAX($A110:Q110)+1,\"\")","v":""},{"$f":"IF(S1<>\"\",MAX($A110:R110)+1,\"\")","v":""},{"$f":"IF(T1<>\"\",MAX($A110:S110)+1,\"\")","v":""},{"$f":"IF(U1<>\"\",MAX($A110:T110)+1,\"\")","v":""},{"$f":"IF(V1<>\"\",MAX($A110:U110)+1,\"\")","v":""},{"$f":"IF(W1<>\"\",MAX($A110:V110)+1,\"\")","v":""},{"$f":"IF(X1<>\"\",MAX($A110:W110)+1,\"\")","v":""},{"$f":"IF(Y1<>\"\",MAX($A110:X110)+1,\"\")","v":""},{"$f":"IF(Z1<>\"\",MAX($A110:Y110)+1,\"\")","v":""},{"$f":"IF(AA1<>\"\",MAX($A110:Z110)+1,\"\")","v":""},{"$f":"IF(AB1<>\"\",MAX($A110:AA110)+1,\"\")","v":""},{"$f":"IF(AC1<>\"\",MAX($A110:AB110)+1,\"\")","v":""},{"$f":"IF(AD1<>\"\",MAX($A110:AC110)+1,\"\")","v":""},{"$f":"IF(AE1<>\"\",MAX($A110:AD110)+1,\"\")","v":""},{"$f":"IF(AF1<>\"\",MAX($A110:AE110)+1,\"\")","v":""},{"$f":"IF(AG1<>\"\",MAX($A110:AF110)+1,\"\")","v":""},{"$f":"IF(AH1<>\"\",MAX($A110:AG110)+1,\"\")","v":""},{"$f":"IF(AI1<>\"\",MAX($A110:AH110)+1,\"\")","v":""},{"$f":"IF(AJ1<>\"\",MAX($A110:AI110)+1,\"\")","v":""},{"$f":"IF(AK1<>\"\",MAX($A110:AJ110)+1,\"\")","v":""},{"$f":"IF(AL1<>\"\",MAX($A110:AK110)+1,\"\")","v":""},{"$f":"IF(AM1<>\"\",MAX($A110:AL110)+1,\"\")","v":""},{"$f":"IF(AN1<>\"\",MAX($A110:AM110)+1,\"\")","v":""},{"$f":"IF(AO1<>\"\",MAX($A110:AN110)+1,\"\")","v":""},{"$f":"IF(AP1<>\"\",MAX($A110:AO110)+1,\"\")","v":""},{"$f":"IF(AQ1<>\"\",MAX($A110:AP110)+1,\"\")","v":""},{"$f":"IF(AR1<>\"\",MAX($A110:AQ110)+1,\"\")","v":""},{"$f":"IF(AS1<>\"\",MAX($A110:AR110)+1,\"\")","v":""},{"$f":"IF(AT1<>\"\",MAX($A110:AS110)+1,\"\")","v":""},{"$f":"IF(AU1<>\"\",MAX($A110:AT110)+1,\"\")","v":""},{"$f":"IF(AV1<>\"\",MAX($A110:AU110)+1,\"\")","v":""},{"$f":"IF(AW1<>\"\",MAX($A110:AV110)+1,\"\")","v":""},{"$f":"IF(AX1<>\"\",MAX($A110:AW110)+1,\"\")","v":""},{"$f":"IF(AY1<>\"\",MAX($A110:AX110)+1,\"\")","v":""},{"$f":"IF(AZ1<>\"\",MAX($A110:AY110)+1,\"\")","v":""},{"$f":"IF(BA1<>\"\",MAX($A110:AZ110)+1,\"\")","v":""},{"$f":"IF(BB1<>\"\",MAX($A110:BA110)+1,\"\")","v":""},{"$f":"IF(BC1<>\"\",MAX($A110:BB110)+1,\"\")","v":""},{"$f":"IF(BD1<>\"\",MAX($A110:BC110)+1,\"\")","v":""},{"$f":"IF(BE1<>\"\",MAX($A110:BD110)+1,\"\")","v":""},{"$f":"IF(BF1<>\"\",MAX($A110:BE110)+1,\"\")","v":""},{"$f":"IF(BG1<>\"\",MAX($A110:BF110)+1,\"\")","v":""},{"$f":"IF(BH1<>\"\",MAX($A110:BG110)+1,\"\")","v":""},{"$f":"IF(BI1<>\"\",MAX($A110:BH110)+1,\"\")","v":""},{"$f":"IF(BJ1<>\"\",MAX($A110:BI110)+1,\"\")","v":""},{"$f":"IF(BK1<>\"\",MAX($A110:BJ110)+1,\"\")","v":""},{"$f":"IF(BL1<>\"\",MAX($A110:BK110)+1,\"\")","v":""},{"$f":"IF(BM1<>\"\",MAX($A110:BL110)+1,\"\")","v":""},{"$f":"IF(BN1<>\"\",MAX($A110:BM110)+1,\"\")","v":""},{"$f":"IF(BO1<>\"\",MAX($A110:BN110)+1,\"\")","v":""},{"$f":"IF(BP1<>\"\",MAX($A110:BO110)+1,\"\")","v":""},{"$f":"IF(BQ1<>\"\",MAX($A110:BP110)+1,\"\")","v":""},{"$f":"IF(BR1<>\"\",MAX($A110:BQ110)+1,\"\")","v":""},{"$f":"IF(BS1<>\"\",MAX($A110:BR110)+1,\"\")","v":""},{"$f":"IF(BT1<>\"\",MAX($A110:BS110)+1,\"\")","v":""},{"$f":"IF(BU1<>\"\",MAX($A110:BT110)+1,\"\")","v":""},{"$f":"IF(BV1<>\"\",MAX($A110:BU110)+1,\"\")","v":""},{"$f":"IF(BW1<>\"\",MAX($A110:BV110)+1,\"\")","v":""},{"$f":"IF(BX1<>\"\",MAX($A110:BW110)+1,\"\")","v":""},{"$f":"IF(BY1<>\"\",MAX($A110:BX110)+1,\"\")","v":""},{"$f":"IF(BZ1<>\"\",MAX($A110:BY110)+1,\"\")","v":""},{"$f":"IF(CA1<>\"\",MAX($A110:BZ110)+1,\"\")","v":""},{"$f":"IF(CB1<>\"\",MAX($A110:CA110)+1,\"\")","v":""},{"$f":"IF(CC1<>\"\",MAX($A110:CB110)+1,\"\")","v":""},{"$f":"IF(CD1<>\"\",MAX($A110:CC110)+1,\"\")","v":""},{"$f":"IF(CE1<>\"\",MAX($A110:CD110)+1,\"\")","v":""},{"$f":"IF(CF1<>\"\",MAX($A110:CE110)+1,\"\")","v":""},{"$f":"IF(CG1<>\"\",MAX($A110:CF110)+1,\"\")","v":""},{"$f":"IF(CH1<>\"\",MAX($A110:CG110)+1,\"\")","v":""},{"$f":"IF(CI1<>\"\",MAX($A110:CH110)+1,\"\")","v":""},{"$f":"IF(CJ1<>\"\",MAX($A110:CI110)+1,\"\")","v":""},{"$f":"IF(CK1<>\"\",MAX($A110:CJ110)+1,\"\")","v":""},{"$f":"IF(CL1<>\"\",MAX($A110:CK110)+1,\"\")","v":""},{"$f":"IF(CM1<>\"\",MAX($A110:CL110)+1,\"\")","v":""},{"$f":"IF(CN1<>\"\",MAX($A110:CM110)+1,\"\")","v":""},{"$f":"IF(CO1<>\"\",MAX($A110:CN110)+1,\"\")","v":""},{"$f":"IF(CP1<>\"\",MAX($A110:CO110)+1,\"\")","v":""},{"$f":"IF(CQ1<>\"\",MAX($A110:CP110)+1,\"\")","v":""},{"$f":"IF(CR1<>\"\",MAX($A110:CQ110)+1,\"\")","v":""},{"$f":"IF(CS1<>\"\",MAX($A110:CR110)+1,\"\")","v":""},{"$f":"IF(CT1<>\"\",MAX($A110:CS110)+1,\"\")","v":""},{"$f":"IF(CU1<>\"\",MAX($A110:CT110)+1,\"\")","v":""},{"$f":"IF(CV1<>\"\",MAX($A110:CU110)+1,\"\")","v":""},{"$f":"IF(CW1<>\"\",MAX($A110:CV110)+1,\"\")","v":""},{"$f":"IF(CX1<>\"\",MAX($A110:CW110)+1,\"\")","v":""},null,{"$f":"IF(CZ1<>\"\",MAX($A110:CY110)+1,\"\")","v":""},{"$f":"IF(DA1<>\"\",MAX($A110:CZ110)+1,\"\")","v":""},{"$f":"IF(DB1<>\"\",MAX($A110:DA110)+1,\"\")","v":""},{"$f":"IF(DC1<>\"\",MAX($A110:DB110)+1,\"\")","v":""},{"$f":"IF(DD1<>\"\",MAX($A110:DC110)+1,\"\")","v":""},{"$f":"IF(DE1<>\"\",MAX($A110:DD110)+1,\"\")","v":""},{"$f":"IF(DF1<>\"\",MAX($A110:DE110)+1,\"\")","v":""},{"$f":"IF(DG1<>\"\",MAX($A110:DF110)+1,\"\")","v":""},{"$f":"IF(DH1<>\"\",MAX($A110:DG110)+1,\"\")","v":""},{"$f":"IF(DI1<>\"\",MAX($A110:DH110)+1,\"\")","v":""},{"$f":"IF(DJ1<>\"\",MAX($A110:DI110)+1,\"\")","v":""},{"$f":"IF(DK1<>\"\",MAX($A110:DJ110)+1,\"\")","v":""},{"$f":"IF(DL1<>\"\",MAX($A110:DK110)+1,\"\")","v":""},{"$f":"IF(DM1<>\"\",MAX($A110:DL110)+1,\"\")","v":""},{"$f":"IF(DN1<>\"\",MAX($A110:DM110)+1,\"\")","v":""},{"$f":"IF(DO1<>\"\",MAX($A110:DN110)+1,\"\")","v":""},{"$f":"IF(DP1<>\"\",MAX($A110:DO110)+1,\"\")","v":""},{"$f":"IF(DQ1<>\"\",MAX($A110:DP110)+1,\"\")","v":""},{"$f":"IF(DR1<>\"\",MAX($A110:DQ110)+1,\"\")","v":""},{"$f":"IF(DS1<>\"\",MAX($A110:DR110)+1,\"\")","v":""},{"$f":"IF(DT1<>\"\",MAX($A110:DS110)+1,\"\")","v":""},{"$f":"IF(DU1<>\"\",MAX($A110:DT110)+1,\"\")","v":""},{"$f":"IF(DV1<>\"\",MAX($A110:DU110)+1,\"\")","v":""},{"$f":"IF(DW1<>\"\",MAX($A110:DV110)+1,\"\")","v":""},{"$f":"IF(DX1<>\"\",MAX($A110:DW110)+1,\"\")","v":""},{"$f":"IF(DY1<>\"\",MAX($A110:DX110)+1,\"\")","v":""},{"$f":"IF(DZ1<>\"\",MAX($A110:DY110)+1,\"\")","v":""},{"$f":"IF(EA1<>\"\",MAX($A110:DZ110)+1,\"\")","v":""},{"$f":"IF(EB1<>\"\",MAX($A110:EA110)+1,\"\")","v":""},{"$f":"IF(EC1<>\"\",MAX($A110:EB110)+1,\"\")","v":""},{"$f":"IF(ED1<>\"\",MAX($A110:EC110)+1,\"\")","v":""},{"$f":"IF(EE1<>\"\",MAX($A110:ED110)+1,\"\")","v":""},{"$f":"IF(EF1<>\"\",MAX($A110:EE110)+1,\"\")","v":""},{"$f":"IF(EG1<>\"\",MAX($A110:EF110)+1,\"\")","v":""},{"$f":"IF(EH1<>\"\",MAX($A110:EG110)+1,\"\")","v":""},{"$f":"IF(EI1<>\"\",MAX($A110:EH110)+1,\"\")","v":""},{"$f":"IF(EJ1<>\"\",MAX($A110:EI110)+1,\"\")","v":""},{"$f":"IF(EK1<>\"\",MAX($A110:EJ110)+1,\"\")","v":""},{"$f":"IF(EL1<>\"\",MAX($A110:EK110)+1,\"\")","v":""},{"$f":"IF(EM1<>\"\",MAX($A110:EL110)+1,\"\")","v":""},{"$f":"IF(EN1<>\"\",MAX($A110:EM110)+1,\"\")","v":""},{"$f":"IF(EO1<>\"\",MAX($A110:EN110)+1,\"\")","v":""},{"$f":"IF(EP1<>\"\",MAX($A110:EO110)+1,\"\")","v":""},{"$f":"IF(EQ1<>\"\",MAX($A110:EP110)+1,\"\")","v":""},{"$f":"IF(ER1<>\"\",MAX($A110:EQ110)+1,\"\")","v":""},{"$f":"IF(ES1<>\"\",MAX($A110:ER110)+1,\"\")","v":""},{"$f":"IF(ET1<>\"\",MAX($A110:ES110)+1,\"\")","v":""},{"$f":"IF(EU1<>\"\",MAX($A110:ET110)+1,\"\")","v":""},{"$f":"IF(EV1<>\"\",MAX($A110:EU110)+1,\"\")","v":""},{"$f":"IF(EW1<>\"\",MAX($A110:EV110)+1,\"\")","v":""},{"$f":"IF(EX1<>\"\",MAX($A110:EW110)+1,\"\")","v":""},{"$f":"IF(EY1<>\"\",MAX($A110:EX110)+1,\"\")","v":""},{"$f":"IF(EZ1<>\"\",MAX($A110:EY110)+1,\"\")","v":""},{"$f":"IF(FA1<>\"\",MAX($A110:EZ110)+1,\"\")","v":""},{"$f":"IF(FB1<>\"\",MAX($A110:FA110)+1,\"\")","v":""},{"$f":"IF(FC1<>\"\",MAX($A110:FB110)+1,\"\")","v":""},{"$f":"IF(FD1<>\"\",MAX($A110:FC110)+1,\"\")","v":""},{"$f":"IF(FE1<>\"\",MAX($A110:FD110)+1,\"\")","v":""},{"$f":"IF(FF1<>\"\",MAX($A110:FE110)+1,\"\")","v":""},{"$f":"IF(FG1<>\"\",MAX($A110:FF110)+1,\"\")","v":""},{"$f":"IF(FH1<>\"\",MAX($A110:FG110)+1,\"\")","v":""},{"$f":"IF(FI1<>\"\",MAX($A110:FH110)+1,\"\")","v":""},{"$f":"IF(FJ1<>\"\",MAX($A110:FI110)+1,\"\")","v":""},{"$f":"IF(FK1<>\"\",MAX($A110:FJ110)+1,\"\")","v":""},{"$f":"IF(FL1<>\"\",MAX($A110:FK110)+1,\"\")","v":""},{"$f":"IF(FM1<>\"\",MAX($A110:FL110)+1,\"\")","v":""},{"$f":"IF(FN1<>\"\",MAX($A110:FM110)+1,\"\")","v":""},{"$f":"IF(FO1<>\"\",MAX($A110:FN110)+1,\"\")","v":""},{"$f":"IF(FP1<>\"\",MAX($A110:FO110)+1,\"\")","v":""},{"$f":"IF(FQ1<>\"\",MAX($A110:FP110)+1,\"\")","v":""},{"$f":"IF(FR1<>\"\",MAX($A110:FQ110)+1,\"\")","v":""},{"$f":"IF(FS1<>\"\",MAX($A110:FR110)+1,\"\")","v":""},{"$f":"IF(FT1<>\"\",MAX($A110:FS110)+1,\"\")","v":""},{"$f":"IF(FU1<>\"\",MAX($A110:FT110)+1,\"\")","v":""},{"$f":"IF(FV1<>\"\",MAX($A110:FU110)+1,\"\")","v":""},{"$f":"IF(FW1<>\"\",MAX($A110:FV110)+1,\"\")","v":""},{"$f":"IF(FX1<>\"\",MAX($A110:FW110)+1,\"\")","v":""},{"$f":"IF(FY1<>\"\",MAX($A110:FX110)+1,\"\")","v":""},{"$f":"IF(FZ1<>\"\",MAX($A110:FY110)+1,\"\")","v":""},{"$f":"IF(GA1<>\"\",MAX($A110:FZ110)+1,\"\")","v":""},{"$f":"IF(GB1<>\"\",MAX($A110:GA110)+1,\"\")","v":""},{"$f":"IF(GC1<>\"\",MAX($A110:GB110)+1,\"\")","v":""},{"$f":"IF(GD1<>\"\",MAX($A110:GC110)+1,\"\")","v":""},{"$f":"IF(GE1<>\"\",MAX($A110:GD110)+1,\"\")","v":""},{"$f":"IF(GF1<>\"\",MAX($A110:GE110)+1,\"\")","v":""},{"$f":"IF(GG1<>\"\",MAX($A110:GF110)+1,\"\")","v":""},{"$f":"IF(GH1<>\"\",MAX($A110:GG110)+1,\"\")","v":""},{"$f":"IF(GI1<>\"\",MAX($A110:GH110)+1,\"\")","v":""},{"$f":"IF(GJ1<>\"\",MAX($A110:GI110)+1,\"\")","v":""},{"$f":"IF(GK1<>\"\",MAX($A110:GJ110)+1,\"\")","v":""},{"$f":"IF(GL1<>\"\",MAX($A110:GK110)+1,\"\")","v":""},{"$f":"IF(GM1<>\"\",MAX($A110:GL110)+1,\"\")","v":""},{"$f":"IF(GN1<>\"\",MAX($A110:GM110)+1,\"\")","v":""},{"$f":"IF(GO1<>\"\",MAX($A110:GN110)+1,\"\")","v":""},{"$f":"IF(GP1<>\"\",MAX($A110:GO110)+1,\"\")","v":""},{"$f":"IF(GQ1<>\"\",MAX($A110:GP110)+1,\"\")","v":""},{"$f":"IF(GR1<>\"\",MAX($A110:GQ110)+1,\"\")","v":""},{"$f":"IF(GS1<>\"\",MAX($A110:GR110)+1,\"\")","v":""}]

{"sheet":"FactorTable","index":7,"n_rows":111,"n_cols":201,"rows_kept":111,"cut":false,"hidden":false,"merged":[[0,193,0,194],[0,195,0,196],[0,197,0,198],[0,199,0,200],[0,181,0,182],[0,183,0,184],[0,185,0,186],[0,187,0,188],[0,189,0,190],[0,191,0,192],[0,179,0,180],[0,157,0,158],[0,159,0,160],[0,161,0,162],[0,163,0,164],[0,165,0,166],[0,167,0,168],[0,169,0,170],[0,171,0,172],[0,173,0,174],[0,175,0,176],[0,177,0,178],[0,155,0,156],[0,133,0,134],[0,135,0,136],[0,137,0,138],[0,139,0,140],[0,141,0,142],[0,143,0,144],[0,145,0,146],[0,147,0,148],[0,149,0,150],[0,151,0,152],[0,153,0,154],[0,131,0,132],[0,109,0,110],[0,111,0,112],[0,113,0,114],[0,115,0,116],[0,117,0,118],[0,119,0,120],[0,121,0,122],[0,123,0,124],[0,125,0,126],[0,127,0,128],[0,129,0,130],[0,107,0,108],[0,85,0,86],[0,87,0,88],[0,89,0,90],[0,91,0,92],[0,93,0,94],[0,95,0,96],[0,97,0,98],[0,99,0,100],[0,101,0,102],[0,103,0,104],[0,105,0,106],[0,83,0,84],[0,61,0,62],[0,63,0,64],[0,65,0,66],[0,67,0,68],[0,69,0,70],[0,71,0,72],[0,73,0,74],[0,75,0,76],[0,77,0,78],[0,79,0,80],[0,81,0,82],[0,59,0,60],[0,37,0,38],[0,39,0,40],[0,41,0,42],[0,43,0,44],[0,45,0,46],[0,47,0,48],[0,49,0,50],[0,51,0,52],[0,53,0,54],[0,55,0,56],[0,57,0,58],[0,11,0,12],[0,1,0,2],[0,3,0,4],[0,5,0,6],[0,7,0,8],[0,9,0,10],[0,35,0,36],[0,13,0,14],[0,15,0,16],[0,17,0,18],[0,19,0,20],[0,21,0,22],[0,23,0,24],[0,25,0,26],[0,27,0,28],[0,29,0,30],[0,31,0,32],[0,33,0,34],[1,11,1,12],[1,13,1,14],[1,15,1,16],[1,17,1,18],[1,19,1,20],[1,1,1,2],[1,3,1,4],[1,5,1,6],[1,7,1,8],[1,9,1,10],[1,31,1,32],[1,33,1,34],[1,35,1,36],[1,37,1,38],[1,39,1,40],[1,21,1,22],[1,23,1,24],[1,25,1,26],[1,27,1,28],[1,29,1,30],[1,51,1,52],[1,53,1,54],[1,55,1,56],[1,57,1,58],[1,59,1,60],[1,41,1,42],[1,43,1,44],[1,45,1,46],[1,47,1,48],[1,49,1,50],[1,71,1,72],[1,73,1,74],[1,75,1,76],[1,77,1,78],[1,79,1,80],[1,61,1,62],[1,63,1,64],[1,65,1,66],[1,67,1,68],[1,69,1,70],[1,91,1,92],[1,93,1,94],[1,95,1,96],[1,97,1,98],[1,99,1,100],[1,81,1,82],[1,83,1,84],[1,85,1,86],[1,87,1,88],[1,89,1,90],[1,111,1,112],[1,113,1,114],[1,115,1,116],[1,117,1,118],[1,119,1,120],[1,101,1,102],[1,103,1,104],[1,105,1,106],[1,107,1,108],[1,109,1,110],[1,131,1,132],[1,133,1,134],[1,135,1,136],[1,137,1,138],[1,139,1,140],[1,121,1,122],[1,123,1,124],[1,125,1,126],[1,127,1,128],[1,129,1,130],[1,151,1,152],[1,153,1,154],[1,155,1,156],[1,157,1,158],[1,159,1,160],[1,141,1,142],[1,143,1,144],[1,145,1,146],[1,147,1,148],[1,149,1,150],[1,171,1,172],[1,173,1,174],[1,175,1,176],[1,177,1,178],[1,179,1,180],[1,161,1,162],[1,163,1,164],[1,165,1,166],[1,167,1,168],[1,169,1,170],[1,191,1,192],[1,193,1,194],[1,195,1,196],[1,197,1,198],[1,199,1,200],[1,181,1,182],[1,183,1,184],[1,185,1,186],[1,187,1,188],[1,189,1,190]]}
["Development","ZeroTable",null,"Level",null,"D1",null,"D2",null,"D3",null,"AutoPDp0",null,"HomeDwellingp0"]
["Distribution","normal",null,"normal",null,"normal",null,"normal",null,"gamma",null,"normal",null,"normal"]
["Year",{"$f":"IF(B2=\"normal\",\"mean\",IF(B2=\"lognormal\",\"meanlog\",IF(B2=\"gamma\",\"shape\",\"\")))","v":"mean"},{"$f":"IF(B2=\"normal\",\"vol\",IF(B2=\"lognormal\",\"sdlog\",IF(B2=\"gamma\",\"scale\",\"\")))","v":"vol"},{"$f":"IF(D2=\"normal\",\"mean\",IF(D2=\"lognormal\",\"meanlog\",IF(D2=\"gamma\",\"shape\",\"\")))","v":"mean"},{"$f":"IF(D2=\"normal\",\"vol\",IF(D2=\"lognormal\",\"sdlog\",IF(D2=\"gamma\",\"scale\",\"\")))","v":"vol"},{"$f":"IF(F2=\"normal\",\"mean\",IF(F2=\"lognormal\",\"meanlog\",IF(F2=\"gamma\",\"shape\",\"\")))","v":"mean"},{"$f":"IF(F2=\"normal\",\"vol\",IF(F2=\"lognormal\",\"sdlog\",IF(F2=\"gamma\",\"scale\",\"\")))","v":"vol"},{"$f":"IF(H2=\"normal\",\"mean\",IF(H2=\"lognormal\",\"meanlog\",IF(H2=\"gamma\",\"shape\",\"\")))","v":"mean"},{"$f":"IF(H2=\"normal\",\"vol\",IF(H2=\"lognormal\",\"sdlog\",IF(H2=\"gamma\",\"scale\",\"\")))","v":"vol"},{"$f":"IF(J2=\"normal\",\"mean\",IF(J2=\"lognormal\",\"meanlog\",IF(J2=\"gamma\",\"shape\",\"\")))","v":"shape"},{"$f":"IF(J2=\"normal\",\"vol\",IF(J2=\"lognormal\",\"sdlog\",IF(J2=\"gamma\",\"scale\",\"\")))","v":"scale"},"mean",{"$f":"IF(L2=\"normal\",\"vol\",IF(L2=\"lognormal\",\"sdlog\",IF(L2=\"gamma\",\"scale\",\"\")))","v":"vol"},"mean",{"$f":"IF(N2=\"normal\",\"vol\",IF(N2=\"lognormal\",\"sdlog\",IF(N2=\"gamma\",\"scale\",\"\")))","v":"vol"},{"$f":"IF(P2=\"normal\",\"mean\",IF(P2=\"lognormal\",\"meanlog\",IF(P2=\"gamma\",\"shape\",\"\")))","v":""},{"$f":"IF(P2=\"normal\",\"vol\",IF(P2=\"lognormal\",\"sdlog\",IF(P2=\"gamma\",\"scale\",\"\")))","v":""},{"$f":"IF(R2=\"normal\",\"mean\",IF(R2=\"lognormal\",\"meanlog\",IF(R2=\"gamma\",\"shape\",\"\")))","v":""},{"$f":"IF(R2=\"normal\",\"vol\",IF(R2=\"lognormal\",\"sdlog\",IF(R2=\"gamma\",\"scale\",\"\")))","v":""},{"$f":"IF(T2=\"normal\",\"mean\",IF(T2=\"lognormal\",\"meanlog\",IF(T2=\"gamma\",\"shape\",\"\")))","v":""},{"$f":"IF(T2=\"normal\",\"vol\",IF(T2=\"lognormal\",\"sdlog\",IF(T2=\"gamma\",\"scale\",\"\")))","v":""},{"$f":"IF(V2=\"normal\",\"mean\",IF(V2=\"lognormal\",\"meanlog\",IF(V2=\"gamma\",\"shape\",\"\")))","v":""},{"$f":"IF(V2=\"normal\",\"vol\",IF(V2=\"lognormal\",\"sdlog\",IF(V2=\"gamma\",\"scale\",\"\")))","v":""},{"$f":"IF(X2=\"normal\",\"mean\",IF(X2=\"lognormal\",\"meanlog\",IF(X2=\"gamma\",\"shape\",\"\")))","v":""},{"$f":"IF(X2=\"normal\",\"vol\",IF(X2=\"lognormal\",\"sdlog\",IF(X2=\"gamma\",\"scale\",\"\")))","v":""},{"$f":"IF(Z2=\"normal\",\"mean\",IF(Z2=\"lognormal\",\"meanlog\",IF(Z2=\"gamma\",\"shape\",\"\")))","v":""},{"$f":"IF(Z2=\"normal\",\"vol\",IF(Z2=\"lognormal\",\"sdlog\",IF(Z2=\"gamma\",\"scale\",\"\")))","v":""},{"$f":"IF(AB2=\"normal\",\"mean\",IF(AB2=\"lognormal\",\"meanlog\",IF(AB2=\"gamma\",\"shape\",\"\")))","v":""},{"$f":"IF(AB2=\"normal\",\"vol\",IF(AB2=\"lognormal\",\"sdlog\",IF(AB2=\"gamma\",\"scale\",\"\")))","v":""},{"$f":"IF(AD2=\"normal\",\"mean\",IF(AD2=\"lognormal\",\"meanlog\",IF(AD2=\"gamma\",\"shape\",\"\")))","v":""},{"$f":"IF(AD2=\"normal\",\"vol\",IF(AD2=\"lognormal\",\"sdlog\",IF(AD2=\"gamma\",\"scale\",\"\")))","v":""},{"$f":"IF(AF2=\"normal\",\"mean\",IF(AF2=\"lognormal\",\"meanlog\",IF(AF2=\"gamma\",\"shape\",\"\")))","v":""},{"$f":"IF(AF2=\"normal\",\"vol\",IF(AF2=\"lognormal\",\"sdlog\",IF(AF2=\"gamma\",\"scale\",\"\")))","v":""},{"$f":"IF(AH2=\"normal\",\"mean\",IF(AH2=\"lognormal\",\"meanlog\",IF(AH2=\"gamma\",\"shape\",\"\")))","v":""},{"$f":"IF(AH2=\"normal\",\"vol\",IF(AH2=\"lognormal\",\"sdlog\",IF(AH2=\"gamma\",\"scale\",\"\")))","v":""},{"$f":"IF(AJ2=\"normal\",\"mean\",IF(AJ2=\"lognormal\",\"meanlog\",IF(AJ2=\"gamma\",\"shape\",\"\")))","v":""},{"$f":"IF(AJ2=\"normal\",\"vol\",IF(AJ2=\"lognormal\",\"sdlog\",IF(AJ2=\"gamma\",\"scale\",\"\")))","v":""},{"$f":"IF(AL2=\"normal\",\"mean\",IF(AL2=\"lognormal\",\"meanlog\",IF(AL2=\"gamma\",\"shape\",\"\")))","v":""},{"$f":"IF(AL2=\"normal\",\"vol\",IF(AL2=\"lognormal\",\"sdlog\",IF(AL2=\"gamma\",\"scale\",\"\")))","v":""},{"$f":"IF(AN2=\"normal\",\"mean\",IF(AN2=\"lognormal\",\"meanlog\",IF(AN2=\"gamma\",\"shape\",\"\")))","v":""},{"$f":"IF(AN2=\"normal\",\"vol\",IF(AN2=\"lognormal\",\"sdlog\",IF(AN2=\"gamma\",\"scale\",\"\")))","v":""},{"$f":"IF(AP2=\"normal\",\"mean\",IF(AP2=\"lognormal\",\"meanlog\",IF(AP2=\"gamma\",\"shape\",\"\")))","v":""},{"$f":"IF(AP2=\"normal\",\"vol\",IF(AP2=\"lognormal\",\"sdlog\",IF(AP2=\"gamma\",\"scale\",\"\")))","v":""},{"$f":"IF(AR2=\"normal\",\"mean\",IF(AR2=\"lognormal\",\"meanlog\",IF(AR2=\"gamma\",\"shape\",\"\")))","v":""},{"$f":"IF(AR2=\"normal\",\"vol\",IF(AR2=\"lognormal\",\"sdlog\",IF(AR2=\"gamma\",\"scale\",\"\")))","v":""},{"$f":"IF(AT2=\"normal\",\"mean\",IF(AT2=\"lognormal\",\"meanlog\",IF(AT2=\"gamma\",\"shape\",\"\")))","v":""},{"$f":"IF(AT2=\"normal\",\"vol\",IF(AT2=\"lognormal\",\"sdlog\",IF(AT2=\"gamma\",\"scale\",\"\")))","v":""},{"$f":"IF(AV2=\"normal\",\"mean\",IF(AV2=\"lognormal\",\"meanlog\",IF(AV2=\"gamma\",\"shape\",\"\")))","v":""},{"$f":"IF(AV2=\"normal\",\"vol\",IF(AV2=\"lognormal\",\"sdlog\",IF(AV2=\"gamma\",\"scale\",\"\")))","v":""},{"$f":"IF(AX2=\"normal\",\"mean\",IF(AX2=\"lognormal\",\"meanlog\",IF(AX2=\"gamma\",\"shape\",\"\")))","v":""},{"$f":"IF(AX2=\"normal\",\"vol\",IF(AX2=\"lognormal\",\"sdlog\",IF(AX2=\"gamma\",\"scale\",\"\")))","v":""},{"$f":"IF(AZ2=\"normal\",\"mean\",IF(AZ2=\"lognormal\",\"meanlog\",IF(AZ2=\"gamma\",\"shape\",\"\")))","v":""},{"$f":"IF(AZ2=\"normal\",\"vol\",IF(AZ2=\"lognormal\",\"sdlog\",IF(AZ2=\"gamma\",\"scale\",\"\")))","v":""},{"$f":"IF(BB2=\"normal\",\"mean\",IF(BB2=\"lognormal\",\"meanlog\",IF(BB2=\"gamma\",\"shape\",\"\")))","v":""},{"$f":"IF(BB2=\"normal\",\"vol\",IF(BB2=\"lognormal\",\"sdlog\",IF(BB2=\"gamma\",\"scale\",\"\")))","v":""},{"$f":"IF(BD2=\"normal\",\"mean\",IF(BD2=\"lognormal\",\"meanlog\",IF(BD2=\"gamma\",\"shape\",\"\")))","v":""},{"$f":"IF(BD2=\"normal\",\"vol\",IF(BD2=\"lognormal\",\"sdlog\",IF(BD2=\"gamma\",\"scale\",\"\")))","v":""},{"$f":"IF(BF2=\"normal\",\"mean\",IF(BF2=\"lognormal\",\"meanlog\",IF(BF2=\"gamma\",\"shape\",\"\")))","v":""},{"$f":"IF(BF2=\"normal\",\"vol\",IF(BF2=\"lognormal\",\"sdlog\",IF(BF2=\"gamma\",\"scale\",\"\")))","v":""},{"$f":"IF(BH2=\"normal\",\"mean\",IF(BH2=\"lognormal\",\"meanlog\",IF(BH2=\"gamma\",\"shape\",\"\")))","v":""},{"$f":"IF(BH2=\"normal\",\"vol\",IF(BH2=\"lognormal\",\"sdlog\",IF(BH2=\"gamma\",\"scale\",\"\")))","v":""},{"$f":"IF(BJ2=\"normal\",\"mean\",IF(BJ2=\"lognormal\",\"meanlog\",IF(BJ2=\"gamma\",\"shape\",\"\")))","v":""},{"$f":"IF(BJ2=\"normal\",\"vol\",IF(BJ2=\"lognormal\",\"sdlog\",IF(BJ2=\"gamma\",\"scale\",\"\")))","v":""},{"$f":"IF(BL2=\"normal\",\"mean\",IF(BL2=\"lognormal\",\"meanlog\",IF(BL2=\"gamma\",\"shape\",\"\")))","v":""},{"$f":"IF(BL2=\"normal\",\"vol\",IF(BL2=\"lognormal\",\"sdlog\",IF(BL2=\"gamma\",\"scale\",\"\")))","v":""},{"$f":"IF(BN2=\"normal\",\"mean\",IF(BN2=\"lognormal\",\"meanlog\",IF(BN2=\"gamma\",\"shape\",\"\")))","v":""},{"$f":"IF(BN2=\"normal\",\"vol\",IF(BN2=\"lognormal\",\"sdlog\",IF(BN2=\"gamma\",\"scale\",\"\")))","v":""},{"$f":"IF(BP2=\"normal\",\"mean\",IF(BP2=\"lognormal\",\"meanlog\",IF(BP2=\"gamma\",\"shape\",\"\")))","v":""},{"$f":"IF(BP2=\"normal\",\"vol\",IF(BP2=\"lognormal\",\"sdlog\",IF(BP2=\"gamma\",\"scale\",\"\")))","v":""},{"$f":"IF(BR2=\"normal\",\"mean\",IF(BR2=\"lognormal\",\"meanlog\",IF(BR2=\"gamma\",\"shape\",\"\")))","v":""},{"$f":"IF(BR2=\"normal\",\"vol\",IF(BR2=\"lognormal\",\"sdlog\",IF(BR2=\"gamma\",\"scale\",\"\")))","v":""},{"$f":"IF(BT2=\"normal\",\"mean\",IF(BT2=\"lognormal\",\"meanlog\",IF(BT2=\"gamma\",\"shape\",\"\")))","v":""},{"$f":"IF(BT2=\"normal\",\"vol\",IF(BT2=\"lognormal\",\"sdlog\",IF(BT2=\"gamma\",\"scale\",\"\")))","v":""},{"$f":"IF(BV2=\"normal\",\"mean\",IF(BV2=\"lognormal\",\"meanlog\",IF(BV2=\"gamma\",\"shape\",\"\")))","v":""},{"$f":"IF(BV2=\"normal\",\"vol\",IF(BV2=\"lognormal\",\"sdlog\",IF(BV2=\"gamma\",\"scale\",\"\")))","v":""},{"$f":"IF(BX2=\"normal\",\"mean\",IF(BX2=\"lognormal\",\"meanlog\",IF(BX2=\"gamma\",\"shape\",\"\")))","v":""},{"$f":"IF(BX2=\"normal\",\"vol\",IF(BX2=\"lognormal\",\"sdlog\",IF(BX2=\"gamma\",\"scale\",\"\")))","v":""},{"$f":"IF(BZ2=\"normal\",\"mean\",IF(BZ2=\"lognormal\",\"meanlog\",IF(BZ2=\"gamma\",\"shape\",\"\")))","v":""},{"$f":"IF(BZ2=\"normal\",\"vol\",IF(BZ2=\"lognormal\",\"sdlog\",IF(BZ2=\"gamma\",\"scale\",\"\")))","v":""},{"$f":"IF(CB2=\"normal\",\"mean\",IF(CB2=\"lognormal\",\"meanlog\",IF(CB2=\"gamma\",\"shape\",\"\")))","v":""},{"$f":"IF(CB2=\"normal\",\"vol\",IF(CB2=\"lognormal\",\"sdlog\",IF(CB2=\"gamma\",\"scale\",\"\")))","v":""},{"$f":"IF(CD2=\"normal\",\"mean\",IF(CD2=\"lognormal\",\"meanlog\",IF(CD2=\"gamma\",\"shape\",\"\")))","v":""},{"$f":"IF(CD2=\"normal\",\"vol\",IF(CD2=\"lognormal\",\"sdlog\",IF(CD2=\"gamma\",\"scale\",\"\")))","v":""},{"$f":"IF(CF2=\"normal\",\"mean\",IF(CF2=\"lognormal\",\"meanlog\",IF(CF2=\"gamma\",\"shape\",\"\")))","v":""},{"$f":"IF(CF2=\"normal\",\"vol\",IF(CF2=\"lognormal\",\"sdlog\",IF(CF2=\"gamma\",\"scale\",\"\")))","v":""},{"$f":"IF(CH2=\"normal\",\"mean\",IF(CH2=\"lognormal\",\"meanlog\",IF(CH2=\"gamma\",\"shape\",\"\")))","v":""},{"$f":"IF(CH2=\"normal\",\"vol\",IF(CH2=\"lognormal\",\"sdlog\",IF(CH2=\"gamma\",\"scale\",\"\")))","v":""},{"$f":"IF(CJ2=\"normal\",\"mean\",IF(CJ2=\"lognormal\",\"meanlog\",IF(CJ2=\"gamma\",\"shape\",\"\")))","v":""},{"$f":"IF(CJ2=\"normal\",\"vol\",IF(CJ2=\"lognormal\",\"sdlog\",IF(CJ2=\"gamma\",\"scale\",\"\")))","v":""},{"$f":"IF(CL2=\"normal\",\"mean\",IF(CL2=\"lognormal\",\"meanlog\",IF(CL2=\"gamma\",\"shape\",\"\")))","v":""},{"$f":"IF(CL2=\"normal\",\"vol\",IF(CL2=\"lognormal\",\"sdlog\",IF(CL2=\"gamma\",\"scale\",\"\")))","v":""},{"$f":"IF(CN2=\"normal\",\"mean\",IF(CN2=\"lognormal\",\"meanlog\",IF(CN2=\"gamma\",\"shape\",\"\")))","v":""},{"$f":"IF(CN2=\"normal\",\"vol\",IF(CN2=\"lognormal\",\"sdlog\",IF(CN2=\"gamma\",\"scale\",\"\")))","v":""},{"$f":"IF(CP2=\"normal\",\"mean\",IF(CP2=\"lognormal\",\"meanlog\",IF(CP2=\"gamma\",\"shape\",\"\")))","v":""},{"$f":"IF(CP2=\"normal\",\"vol\",IF(CP2=\"lognormal\",\"sdlog\",IF(CP2=\"gamma\",\"scale\",\"\")))","v":""},{"$f":"IF(CR2=\"normal\",\"mean\",IF(CR2=\"lognormal\",\"meanlog\",IF(CR2=\"gamma\",\"shape\",\"\")))","v":""},{"$f":"IF(CR2=\"normal\",\"vol\",IF(CR2=\"lognormal\",\"sdlog\",IF(CR2=\"gamma\",\"scale\",\"\")))","v":""},{"$f":"IF(CT2=\"normal\",\"mean\",IF(CT2=\"lognormal\",\"meanlog\",IF(CT2=\"gamma\",\"shape\",\"\")))","v":""},{"$f":"IF(CT2=\"normal\",\"vol\",IF(CT2=\"lognormal\",\"sdlog\",IF(CT2=\"gamma\",\"scale\",\"\")))","v":""},{"$f":"IF(CV2=\"normal\",\"mean\",IF(CV2=\"lognormal\",\"meanlog\",IF(CV2=\"gamma\",\"shape\",\"\")))","v":""},{"$f":"IF(CV2=\"normal\",\"vol\",IF(CV2=\"lognormal\",\"sdlog\",IF(CV2=\"gamma\",\"scale\",\"\")))","v":""},{"$f":"IF(CX2=\"normal\",\"mean\",IF(CX2=\"lognormal\",\"meanlog\",IF(CX2=\"gamma\",\"shape\",\"\")))","v":""},{"$f":"IF(CX2=\"normal\",\"vol\",IF(CX2=\"lognormal\",\"sdlog\",IF(CX2=\"gamma\",\"scale\",\"\")))","v":""},{"$f":"IF(CZ2=\"normal\",\"mean\",IF(CZ2=\"lognormal\",\"meanlog\",IF(CZ2=\"gamma\",\"shape\",\"\")))","v":""},{"$f":"IF(CZ2=\"normal\",\"vol\",IF(CZ2=\"lognormal\",\"sdlog\",IF(CZ2=\"gamma\",\"scale\",\"\")))","v":""},{"$f":"IF(DB2=\"normal\",\"mean\",IF(DB2=\"lognormal\",\"meanlog\",IF(DB2=\"gamma\",\"shape\",\"\")))","v":""},{"$f":"IF(DB2=\"normal\",\"vol\",IF(DB2=\"lognormal\",\"sdlog\",IF(DB2=\"gamma\",\"scale\",\"\")))","v":""},{"$f":"IF(DD2=\"normal\",\"mean\",IF(DD2=\"lognormal\",\"meanlog\",IF(DD2=\"gamma\",\"shape\",\"\")))","v":""},{"$f":"IF(DD2=\"normal\",\"vol\",IF(DD2=\"lognormal\",\"sdlog\",IF(DD2=\"gamma\",\"scale\",\"\")))","v":""},{"$f":"IF(DF2=\"normal\",\"mean\",IF(DF2=\"lognormal\",\"meanlog\",IF(DF2=\"gamma\",\"shape\",\"\")))","v":""},{"$f":"IF(DF2=\"normal\",\"vol\",IF(DF2=\"lognormal\",\"sdlog\",IF(DF2=\"gamma\",\"scale\",\"\")))","v":""},{"$f":"IF(DH2=\"normal\",\"mean\",IF(DH2=\"lognormal\",\"meanlog\",IF(DH2=\"gamma\",\"shape\",\"\")))","v":""},{"$f":"IF(DH2=\"normal\",\"vol\",IF(DH2=\"lognormal\",\"sdlog\",IF(DH2=\"gamma\",\"scale\",\"\")))","v":""},{"$f":"IF(DJ2=\"normal\",\"mean\",IF(DJ2=\"lognormal\",\"meanlog\",IF(DJ2=\"gamma\",\"shape\",\"\")))","v":""},{"$f":"IF(DJ2=\"normal\",\"vol\",IF(DJ2=\"lognormal\",\"sdlog\",IF(DJ2=\"gamma\",\"scale\",\"\")))","v":""},{"$f":"IF(DL2=\"normal\",\"mean\",IF(DL2=\"lognormal\",\"meanlog\",IF(DL2=\"gamma\",\"shape\",\"\")))","v":""},{"$f":"IF(DL2=\"normal\",\"vol\",IF(DL2=\"lognormal\",\"sdlog\",IF(DL2=\"gamma\",\"scale\",\"\")))","v":""},{"$f":"IF(DN2=\"normal\",\"mean\",IF(DN2=\"lognormal\",\"meanlog\",IF(DN2=\"gamma\",\"shape\",\"\")))","v":""},{"$f":"IF(DN2=\"normal\",\"vol\",IF(DN2=\"lognormal\",\"sdlog\",IF(DN2=\"gamma\",\"scale\",\"\")))","v":""},{"$f":"IF(DP2=\"normal\",\"mean\",IF(DP2=\"lognormal\",\"meanlog\",IF(DP2=\"gamma\",\"shape\",\"\")))","v":""},{"$f":"IF(DP2=\"normal\",\"vol\",IF(DP2=\"lognormal\",\"sdlog\",IF(DP2=\"gamma\",\"scale\",\"\")))","v":""},{"$f":"IF(DR2=\"normal\",\"mean\",IF(DR2=\"lognormal\",\"meanlog\",IF(DR2=\"gamma\",\"shape\",\"\")))","v":""},{"$f":"IF(DR2=\"normal\",\"vol\",IF(DR2=\"lognormal\",\"sdlog\",IF(DR2=\"gamma\",\"scale\",\"\")))","v":""},{"$f":"IF(DT2=\"normal\",\"mean\",IF(DT2=\"lognormal\",\"meanlog\",IF(DT2=\"gamma\",\"shape\",\"\")))","v":""},{"$f":"IF(DT2=\"normal\",\"vol\",IF(DT2=\"lognormal\",\"sdlog\",IF(DT2=\"gamma\",\"scale\",\"\")))","v":""},{"$f":"IF(DV2=\"normal\",\"mean\",IF(DV2=\"lognormal\",\"meanlog\",IF(DV2=\"gamma\",\"shape\",\"\")))","v":""},{"$f":"IF(DV2=\"normal\",\"vol\",IF(DV2=\"lognormal\",\"sdlog\",IF(DV2=\"gamma\",\"scale\",\"\")))","v":""},{"$f":"IF(DX2=\"normal\",\"mean\",IF(DX2=\"lognormal\",\"meanlog\",IF(DX2=\"gamma\",\"shape\",\"\")))","v":""},{"$f":"IF(DX2=\"normal\",\"vol\",IF(DX2=\"lognormal\",\"sdlog\",IF(DX2=\"gamma\",\"scale\",\"\")))","v":""},{"$f":"IF(DZ2=\"normal\",\"mean\",IF(DZ2=\"lognormal\",\"meanlog\",IF(DZ2=\"gamma\",\"shape\",\"\")))","v":""},{"$f":"IF(DZ2=\"normal\",\"vol\",IF(DZ2=\"lognormal\",\"sdlog\",IF(DZ2=\"gamma\",\"scale\",\"\")))","v":""},{"$f":"IF(EB2=\"normal\",\"mean\",IF(EB2=\"lognormal\",\"meanlog\",IF(EB2=\"gamma\",\"shape\",\"\")))","v":""},{"$f":"IF(EB2=\"normal\",\"vol\",IF(EB2=\"lognormal\",\"sdlog\",IF(EB2=\"gamma\",\"scale\",\"\")))","v":""},{"$f":"IF(ED2=\"normal\",\"mean\",IF(ED2=\"lognormal\",\"meanlog\",IF(ED2=\"gamma\",\"shape\",\"\")))","v":""},{"$f":"IF(ED2=\"normal\",\"vol\",IF(ED2=\"lognormal\",\"sdlog\",IF(ED2=\"gamma\",\"scale\",\"\")))","v":""},{"$f":"IF(EF2=\"normal\",\"mean\",IF(EF2=\"lognormal\",\"meanlog\",IF(EF2=\"gamma\",\"shape\",\"\")))","v":""},{"$f":"IF(EF2=\"normal\",\"vol\",IF(EF2=\"lognormal\",\"sdlog\",IF(EF2=\"gamma\",\"scale\",\"\")))","v":""},{"$f":"IF(EH2=\"normal\",\"mean\",IF(EH2=\"lognormal\",\"meanlog\",IF(EH2=\"gamma\",\"shape\",\"\")))","v":""},{"$f":"IF(EH2=\"normal\",\"vol\",IF(EH2=\"lognormal\",\"sdlog\",IF(EH2=\"gamma\",\"scale\",\"\")))","v":""},{"$f":"IF(EJ2=\"normal\",\"mean\",IF(EJ2=\"lognormal\",\"meanlog\",IF(EJ2=\"gamma\",\"shape\",\"\")))","v":""},{"$f":"IF(EJ2=\"normal\",\"vol\",IF(EJ2=\"lognormal\",\"sdlog\",IF(EJ2=\"gamma\",\"scale\",\"\")))","v":""},{"$f":"IF(EL2=\"normal\",\"mean\",IF(EL2=\"lognormal\",\"meanlog\",IF(EL2=\"gamma\",\"shape\",\"\")))","v":""},{"$f":"IF(EL2=\"normal\",\"vol\",IF(EL2=\"lognormal\",\"sdlog\",IF(EL2=\"gamma\",\"scale\",\"\")))","v":""},{"$f":"IF(EN2=\"normal\",\"mean\",IF(EN2=\"lognormal\",\"meanlog\",IF(EN2=\"gamma\",\"shape\",\"\")))","v":""},{"$f":"IF(EN2=\"normal\",\"vol\",IF(EN2=\"lognormal\",\"sdlog\",IF(EN2=\"gamma\",\"scale\",\"\")))","v":""},{"$f":"IF(EP2=\"normal\",\"mean\",IF(EP2=\"lognormal\",\"meanlog\",IF(EP2=\"gamma\",\"shape\",\"\")))","v":""},{"$f":"IF(EP2=\"normal\",\"vol\",IF(EP2=\"lognormal\",\"sdlog\",IF(EP2=\"gamma\",\"scale\",\"\")))","v":""},{"$f":"IF(ER2=\"normal\",\"mean\",IF(ER2=\"lognormal\",\"meanlog\",IF(ER2=\"gamma\",\"shape\",\"\")))","v":""},{"$f":"IF(ER2=\"normal\",\"vol\",IF(ER2=\"lognormal\",\"sdlog\",IF(ER2=\"gamma\",\"scale\",\"\")))","v":""},{"$f":"IF(ET2=\"normal\",\"mean\",IF(ET2=\"lognormal\",\"meanlog\",IF(ET2=\"gamma\",\"shape\",\"\")))","v":""},{"$f":"IF(ET2=\"normal\",\"vol\",IF(ET2=\"lognormal\",\"sdlog\",IF(ET2=\"gamma\",\"scale\",\"\")))","v":""},{"$f":"IF(EV2=\"normal\",\"mean\",IF(EV2=\"lognormal\",\"meanlog\",IF(EV2=\"gamma\",\"shape\",\"\")))","v":""},{"$f":"IF(EV2=\"normal\",\"vol\",IF(EV2=\"lognormal\",\"sdlog\",IF(EV2=\"gamma\",\"scale\",\"\")))","v":""},{"$f":"IF(EX2=\"normal\",\"mean\",IF(EX2=\"lognormal\",\"meanlog\",IF(EX2=\"gamma\",\"shape\",\"\")))","v":""},{"$f":"IF(EX2=\"normal\",\"vol\",IF(EX2=\"lognormal\",\"sdlog\",IF(EX2=\"gamma\",\"scale\",\"\")))","v":""},{"$f":"IF(EZ2=\"normal\",\"mean\",IF(EZ2=\"lognormal\",\"meanlog\",IF(EZ2=\"gamma\",\"shape\",\"\")))","v":""},{"$f":"IF(EZ2=\"normal\",\"vol\",IF(EZ2=\"lognormal\",\"sdlog\",IF(EZ2=\"gamma\",\"scale\",\"\")))","v":""},{"$f":"IF(FB2=\"normal\",\"mean\",IF(FB2=\"lognormal\",\"meanlog\",IF(FB2=\"gamma\",\"shape\",\"\")))","v":""},{"$f":"IF(FB2=\"normal\",\"vol\",IF(FB2=\"lognormal\",\"sdlog\",IF(FB2=\"gamma\",\"scale\",\"\")))","v":""},{"$f":"IF(FD2=\"normal\",\"mean\",IF(FD2=\"lognormal\",\"meanlog\",IF(FD2=\"gamma\",\"shape\",\"\")))","v":""},{"$f":"IF(FD2=\"normal\",\"vol\",IF(FD2=\"lognormal\",\"sdlog\",IF(FD2=\"gamma\",\"scale\",\"\")))","v":""},{"$f":"IF(FF2=\"normal\",\"mean\",IF(FF2=\"lognormal\",\"meanlog\",IF(FF2=\"gamma\",\"shape\",\"\")))","v":""},{"$f":"IF(FF2=\"normal\",\"vol\",IF(FF2=\"lognormal\",\"sdlog\",IF(FF2=\"gamma\",\"scale\",\"\")))","v":""},{"$f":"IF(FH2=\"normal\",\"mean\",IF(FH2=\"lognormal\",\"meanlog\",IF(FH2=\"gamma\",\"shape\",\"\")))","v":""},{"$f":"IF(FH2=\"normal\",\"vol\",IF(FH2=\"lognormal\",\"sdlog\",IF(FH2=\"gamma\",\"scale\",\"\")))","v":""},{"$f":"IF(FJ2=\"normal\",\"mean\",IF(FJ2=\"lognormal\",\"meanlog\",IF(FJ2=\"gamma\",\"shape\",\"\")))","v":""},{"$f":"IF(FJ2=\"normal\",\"vol\",IF(FJ2=\"lognormal\",\"sdlog\",IF(FJ2=\"gamma\",\"scale\",\"\")))","v":""},{"$f":"IF(FL2=\"normal\",\"mean\",IF(FL2=\"lognormal\",\"meanlog\",IF(FL2=\"gamma\",\"shape\",\"\")))","v":""},{"$f":"IF(FL2=\"normal\",\"vol\",IF(FL2=\"lognormal\",\"sdlog\",IF(FL2=\"gamma\",\"scale\",\"\")))","v":""},{"$f":"IF(FN2=\"normal\",\"mean\",IF(FN2=\"lognormal\",\"meanlog\",IF(FN2=\"gamma\",\"shape\",\"\")))","v":""},{"$f":"IF(FN2=\"normal\",\"vol\",IF(FN2=\"lognormal\",\"sdlog\",IF(FN2=\"gamma\",\"scale\",\"\")))","v":""},{"$f":"IF(FP2=\"normal\",\"mean\",IF(FP2=\"lognormal\",\"meanlog\",IF(FP2=\"gamma\",\"shape\",\"\")))","v":""},{"$f":"IF(FP2=\"normal\",\"vol\",IF(FP2=\"lognormal\",\"sdlog\",IF(FP2=\"gamma\",\"scale\",\"\")))","v":""},{"$f":"IF(FR2=\"normal\",\"mean\",IF(FR2=\"lognormal\",\"meanlog\",IF(FR2=\"gamma\",\"shape\",\"\")))","v":""},{"$f":"IF(FR2=\"normal\",\"vol\",IF(FR2=\"lognormal\",\"sdlog\",IF(FR2=\"gamma\",\"scale\",\"\")))","v":""},{"$f":"IF(FT2=\"normal\",\"mean\",IF(FT2=\"lognormal\",\"meanlog\",IF(FT2=\"gamma\",\"shape\",\"\")))","v":""},{"$f":"IF(FT2=\"normal\",\"vol\",IF(FT2=\"lognormal\",\"sdlog\",IF(FT2=\"gamma\",\"scale\",\"\")))","v":""},{"$f":"IF(FV2=\"normal\",\"mean\",IF(FV2=\"lognormal\",\"meanlog\",IF(FV2=\"gamma\",\"shape\",\"\")))","v":""},{"$f":"IF(FV2=\"normal\",\"vol\",IF(FV2=\"lognormal\",\"sdlog\",IF(FV2=\"gamma\",\"scale\",\"\")))","v":""},{"$f":"IF(FX2=\"normal\",\"mean\",IF(FX2=\"lognormal\",\"meanlog\",IF(FX2=\"gamma\",\"shape\",\"\")))","v":""},{"$f":"IF(FX2=\"normal\",\"vol\",IF(FX2=\"lognormal\",\"sdlog\",IF(FX2=\"gamma\",\"scale\",\"\")))","v":""},{"$f":"IF(FZ2=\"normal\",\"mean\",IF(FZ2=\"lognormal\",\"meanlog\",IF(FZ2=\"gamma\",\"shape\",\"\")))","v":""},{"$f":"IF(FZ2=\"normal\",\"vol\",IF(FZ2=\"lognormal\",\"sdlog\",IF(FZ2=\"gamma\",\"scale\",\"\")))","v":""},{"$f":"IF(GB2=\"normal\",\"mean\",IF(GB2=\"lognormal\",\"meanlog\",IF(GB2=\"gamma\",\"shape\",\"\")))","v":""},{"$f":"IF(GB2=\"normal\",\"vol\",IF(GB2=\"lognormal\",\"sdlog\",IF(GB2=\"gamma\",\"scale\",\"\")))","v":""},{"$f":"IF(GD2=\"normal\",\"mean\",IF(GD2=\"lognormal\",\"meanlog\",IF(GD2=\"gamma\",\"shape\",\"\")))","v":""},{"$f":"IF(GD2=\"normal\",\"vol\",IF(GD2=\"lognormal\",\"sdlog\",IF(GD2=\"gamma\",\"scale\",\"\")))","v":""},{"$f":"IF(GF2=\"normal\",\"mean\",IF(GF2=\"lognormal\",\"meanlog\",IF(GF2=\"gamma\",\"shape\",\"\")))","v":""},{"$f":"IF(GF2=\"normal\",\"vol\",IF(GF2=\"lognormal\",\"sdlog\",IF(GF2=\"gamma\",\"scale\",\"\")))","v":""},{"$f":"IF(GH2=\"normal\",\"mean\",IF(GH2=\"lognormal\",\"meanlog\",IF(GH2=\"gamma\",\"shape\",\"\")))","v":""},{"$f":"IF(GH2=\"normal\",\"vol\",IF(GH2=\"lognormal\",\"sdlog\",IF(GH2=\"gamma\",\"scale\",\"\")))","v":""},{"$f":"IF(GJ2=\"normal\",\"mean\",IF(GJ2=\"lognormal\",\"meanlog\",IF(GJ2=\"gamma\",\"shape\",\"\")))","v":""},{"$f":"IF(GJ2=\"normal\",\"vol\",IF(GJ2=\"lognormal\",\"sdlog\",IF(GJ2=\"gamma\",\"scale\",\"\")))","v":""},{"$f":"IF(GL2=\"normal\",\"mean\",IF(GL2=\"lognormal\",\"meanlog\",IF(GL2=\"gamma\",\"shape\",\"\")))","v":""},{"$f":"IF(GL2=\"normal\",\"vol\",IF(GL2=\"lognormal\",\"sdlog\",IF(GL2=\"gamma\",\"scale\",\"\")))","v":""},{"$f":"IF(GN2=\"normal\",\"mean\",IF(GN2=\"lognormal\",\"meanlog\",IF(GN2=\"gamma\",\"shape\",\"\")))","v":""},{"$f":"IF(GN2=\"normal\",\"vol\",IF(GN2=\"lognormal\",\"sdlog\",IF(GN2=\"gamma\",\"scale\",\"\")))","v":""},{"$f":"IF(GP2=\"normal\",\"mean\",IF(GP2=\"lognormal\",\"meanlog\",IF(GP2=\"gamma\",\"shape\",\"\")))","v":""},{"$f":"IF(GP2=\"normal\",\"vol\",IF(GP2=\"lognormal\",\"sdlog\",IF(GP2=\"gamma\",\"scale\",\"\")))","v":""},{"$f":"IF(GR2=\"normal\",\"mean\",IF(GR2=\"lognormal\",\"meanlog\",IF(GR2=\"gamma\",\"shape\",\"\")))","v":""},{"$f":"IF(GR2=\"normal\",\"vol\",IF(GR2=\"lognormal\",\"sdlog\",IF(GR2=\"gamma\",\"scale\",\"\")))","v":""}]
[1,0,0,1,0,1.2,5.1281146253329697E-2,0.02,0,1.05,9.4756625989163165E-2,0.105026929982047,0,0,0]
[2,0,0,1,0,1.1499999999999999,4.1533817029231097E-2,1.4999999999999999E-2,0,1.1000000000000001,8.3933725340794449E-2,9.8026050758694805E-2,0,0.293193717277487,0]
[3,0,0,1,0,1.1000000000000001,4.1441197558904699E-2,0.01,0,1.05,7.0366253521590219E-2,0.10454155955441299,0,0.298559423769508,0]
[4,0,0,1,0,1.05,9.2775450453167096E-2,5.0000000000000001E-3,0,1.06,7.8199338409825347E-2,9.9050203527815503E-2,0,0.29565217391304299,0]
[5,0,0,1,0,1,0,0,0,1.07,2.4785048072631554E-2,8.3720930232558097E-2,0]
[6,null,null,null,null,null,null,null,null,1.08,7.9070408041965842E-2,4.7619047619047603E-2,0]
[7,null,null,null,null,null,null,null,null,1.0900000000000001,1.3467483327658625E-2,6.25E-2,0]
[8,null,null,null,null,null,null,null,null,1.06,5.3292320846746968E-2,0,0]
[9,null,null,null,null,null,null,null,null,1,0,0,0]
[10]
[11]
[12]
[13]
[14]
[15]
[16]
[17]
[18]
[19]
[20]
[21]
[22]
[23]
[24]
[25]
[26]
[27]
[28]
[29]
[30]
[31]
[]
[]
[]
[]
[]
[]
[]
[]
[]
[]
[]
[]
[]
[]
[]
[]
[]
[]
[]
[]
[]
[]
[]
[]
[]
[]
[]
[]
[]
[]
[]
[]
[]
[]
[]
[]
[]
[]
[]
[]
[]
[]
[]
[]
[]
[]
[]
[]
[]
[]
[]
[]
[]
[]
[]
[]
[]
[]
[]
[]
[]
[]
[]
[]
[]
[]
[]
[]
[]
[]
[]
[]
[]
[]
[]
[null,"DO NOT CHANGE"]
["Intrim Step ",{"$f":"IF(B1<>\"\",MAX($A111:A111,Function!$C$110:$CX$110)+1,\"\")","v":5},{"$f":"IF(C1<>\"\",MAX($A111:B111)+1,\"\")","v":""},{"$f":"IF(D1<>\"\",MAX($A111:C111)+1,\"\")","v":6},{"$f":"IF(E1<>\"\",MAX($A111:D111)+1,\"\")","v":""},{"$f":"IF(F1<>\"\",MAX($A111:E111)+1,\"\")","v":7},{"$f":"IF(G1<>\"\",MAX($A111:F111)+1,\"\")","v":""},{"$f":"IF(H1<>\"\",MAX($A111:G111)+1,\"\")","v":8},{"$f":"IF(I1<>\"\",MAX($A111:H111)+1,\"\")","v":""},{"$f":"IF(J1<>\"\",MAX($A111:I111)+1,\"\")","v":9},{"$f":"IF(K1<>\"\",MAX($A111:J111)+1,\"\")","v":""},{"$f":"IF(L1<>\"\",MAX($A111:K111)+1,\"\")","v":10},{"$f":"IF(M1<>\"\",MAX($A111:L111)+1,\"\")","v":""},{"$f":"IF(N1<>\"\",MAX($A111:M111)+1,\"\")","v":11},{"$f":"IF(O1<>\"\",MAX($A111:N111)+1,\"\")","v":""},{"$f":"IF(P1<>\"\",MAX($A111:O111)+1,\"\")","v":""},{"$f":"IF(Q1<>\"\",MAX($A111:P111)+1,\"\")","v":""},{"$f":"IF(R1<>\"\",MAX($A111:Q111)+1,\"\")","v":""},{"$f":"IF(S1<>\"\",MAX($A111:R111)+1,\"\")","v":""},{"$f":"IF(T1<>\"\",MAX($A111:S111)+1,\"\")","v":""},{"$f":"IF(U1<>\"\",MAX($A111:T111)+1,\"\")","v":""},{"$f":"IF(V1<>\"\",MAX($A111:U111)+1,\"\")","v":""},{"$f":"IF(W1<>\"\",MAX($A111:V111)+1,\"\")","v":""},{"$f":"IF(X1<>\"\",MAX($A111:W111)+1,\"\")","v":""},{"$f":"IF(Y1<>\"\",MAX($A111:X111)+1,\"\")","v":""},{"$f":"IF(Z1<>\"\",MAX($A111:Y111)+1,\"\")","v":""},{"$f":"IF(AA1<>\"\",MAX($A111:Z111)+1,\"\")","v":""},{"$f":"IF(AB1<>\"\",MAX($A111:AA111)+1,\"\")","v":""},{"$f":"IF(AC1<>\"\",MAX($A111:AB111)+1,\"\")","v":""},{"$f":"IF(AD1<>\"\",MAX($A111:AC111)+1,\"\")","v":""},{"$f":"IF(AE1<>\"\",MAX($A111:AD111)+1,\"\")","v":""},{"$f":"IF(AF1<>\"\",MAX($A111:AE111)+1,\"\")","v":""},{"$f":"IF(AG1<>\"\",MAX($A111:AF111)+1,\"\")","v":""},{"$f":"IF(AH1<>\"\",MAX($A111:AG111)+1,\"\")","v":""},{"$f":"IF(AI1<>\"\",MAX($A111:AH111)+1,\"\")","v":""},{"$f":"IF(AJ1<>\"\",MAX($A111:AI111)+1,\"\")","v":""},{"$f":"IF(AK1<>\"\",MAX($A111:AJ111)+1,\"\")","v":""},{"$f":"IF(AL1<>\"\",MAX($A111:AK111)+1,\"\")","v":""},{"$f":"IF(AM1<>\"\",MAX($A111:AL111)+1,\"\")","v":""},{"$f":"IF(AN1<>\"\",MAX($A111:AM111)+1,\"\")","v":""},{"$f":"IF(AO1<>\"\",MAX($A111:AN111)+1,\"\")","v":""},{"$f":"IF(AP1<>\"\",MAX($A111:AO111)+1,\"\")","v":""},{"$f":"IF(AQ1<>\"\",MAX($A111:AP111)+1,\"\")","v":""},{"$f":"IF(AR1<>\"\",MAX($A111:AQ111)+1,\"\")","v":""},{"$f":"IF(AS1<>\"\",MAX($A111:AR111)+1,\"\")","v":""},{"$f":"IF(AT1<>\"\",MAX($A111:AS111)+1,\"\")","v":""},{"$f":"IF(AU1<>\"\",MAX($A111:AT111)+1,\"\")","v":""},{"$f":"IF(AV1<>\"\",MAX($A111:AU111)+1,\"\")","v":""},{"$f":"IF(AW1<>\"\",MAX($A111:AV111)+1,\"\")","v":""},{"$f":"IF(AX1<>\"\",MAX($A111:AW111)+1,\"\")","v":""},{"$f":"IF(AY1<>\"\",MAX($A111:AX111)+1,\"\")","v":""},{"$f":"IF(AZ1<>\"\",MAX($A111:AY111)+1,\"\")","v":""},{"$f":"IF(BA1<>\"\",MAX($A111:AZ111)+1,\"\")","v":""},{"$f":"IF(BB1<>\"\",MAX($A111:BA111)+1,\"\")","v":""},{"$f":"IF(BC1<>\"\",MAX($A111:BB111)+1,\"\")","v":""},{"$f":"IF(BD1<>\"\",MAX($A111:BC111)+1,\"\")","v":""},{"$f":"IF(BE1<>\"\",MAX($A111:BD111)+1,\"\")","v":""},{"$f":"IF(BF1<>\"\",MAX($A111:BE111)+1,\"\")","v":""},{"$f":"IF(BG1<>\"\",MAX($A111:BF111)+1,\"\")","v":""},{"$f":"IF(BH1<>\"\",MAX($A111:BG111)+1,\"\")","v":""},{"$f":"IF(BI1<>\"\",MAX($A111:BH111)+1,\"\")","v":""},{"$f":"IF(BJ1<>\"\",MAX($A111:BI111)+1,\"\")","v":""},{"$f":"IF(BK1<>\"\",MAX($A111:BJ111)+1,\"\")","v":""},{"$f":"IF(BL1<>\"\",MAX($A111:BK111)+1,\"\")","v":""},{"$f":"IF(BM1<>\"\",MAX($A111:BL111)+1,\"\")","v":""},{"$f":"IF(BN1<>\"\",MAX($A111:BM111)+1,\"\")","v":""},{"$f":"IF(BO1<>\"\",MAX($A111:BN111)+1,\"\")","v":""},{"$f":"IF(BP1<>\"\",MAX($A111:BO111)+1,\"\")","v":""},{"$f":"IF(BQ1<>\"\",MAX($A111:BP111)+1,\"\")","v":""},{"$f":"IF(BR1<>\"\",MAX($A111:BQ111)+1,\"\")","v":""},{"$f":"IF(BS1<>\"\",MAX($A111:BR111)+1,\"\")","v":""},{"$f":"IF(BT1<>\"\",MAX($A111:BS111)+1,\"\")","v":""},{"$f":"IF(BU1<>\"\",MAX($A111:BT111)+1,\"\")","v":""},{"$f":"IF(BV1<>\"\",MAX($A111:BU111)+1,\"\")","v":""},{"$f":"IF(BW1<>\"\",MAX($A111:BV111)+1,\"\")","v":""},{"$f":"IF(BX1<>\"\",MAX($A111:BW111)+1,\"\")","v":""},{"$f":"IF(BY1<>\"\",MAX($A111:BX111)+1,\"\")","v":""},{"$f":"IF(BZ1<>\"\",MAX($A111:BY111)+1,\"\")","v":""},{"$f":"IF(CA1<>\"\",MAX($A111:BZ111)+1,\"\")","v":""},{"$f":"IF(CB1<>\"\",MAX($A111:CA111)+1,\"\")","v":""},{"$f":"IF(CC1<>\"\",MAX($A111:CB111)+1,\"\")","v":""},{"$f":"IF(CD1<>\"\",MAX($A111:CC111)+1,\"\")","v":""},{"$f":"IF(CE1<>\"\",MAX($A111:CD111)+1,\"\")","v":""},{"$f":"IF(CF1<>\"\",MAX($A111:CE111)+1,\"\")","v":""},{"$f":"IF(CG1<>\"\",MAX($A111:CF111)+1,\"\")","v":""},{"$f":"IF(CH1<>\"\",MAX($A111:CG111)+1,\"\")","v":""},{"$f":"IF(CI1<>\"\",MAX($A111:CH111)+1,\"\")","v":""},{"$f":"IF(CJ1<>\"\",MAX($A111:CI111)+1,\"\")","v":""},{"$f":"IF(CK1<>\"\",MAX($A111:CJ111)+1,\"\")","v":""},{"$f":"IF(CL1<>\"\",MAX($A111:CK111)+1,\"\")","v":""},{"$f":"IF(CM1<>\"\",MAX($A111:CL111)+1,\"\")","v":""},{"$f":"IF(CN1<>\"\",MAX($A111:CM111)+1,\"\")","v":""},{"$f":"IF(CO1<>\"\",MAX($A111:CN111)+1,\"\")","v":""},{"$f":"IF(CP1<>\"\",MAX($A111:CO111)+1,\"\")","v":""},{"$f":"IF(CQ1<>\"\",MAX($A111:CP111)+1,\"\")","v":""},{"$f":"IF(CR1<>\"\",MAX($A111:CQ111)+1,\"\")","v":""},{"$f":"IF(CS1<>\"\",MAX($A111:CR111)+1,\"\")","v":""},{"$f":"IF(CT1<>\"\",MAX($A111:CS111)+1,\"\")","v":""},{"$f":"IF(CU1<>\"\",MAX($A111:CT111)+1,\"\")","v":""},{"$f":"IF(CV1<>\"\",MAX($A111:CU111)+1,\"\")","v":""},{"$f":"IF(CW1<>\"\",MAX($A111:CV111)+1,\"\")","v":""},{"$f":"IF(CX1<>\"\",MAX($A111:CW111)+1,\"\")","v":""},{"$f":"IF(CY1<>\"\",MAX($A111:CX111)+1,\"\")","v":""},{"$f":"IF(CZ1<>\"\",MAX($A111:CY111)+1,\"\")","v":""},{"$f":"IF(DA1<>\"\",MAX($A111:CZ111)+1,\"\")","v":""},{"$f":"IF(DB1<>\"\",MAX($A111:DA111)+1,\"\")","v":""},{"$f":"IF(DC1<>\"\",MAX($A111:DB111)+1,\"\")","v":""},{"$f":"IF(DD1<>\"\",MAX($A111:DC111)+1,\"\")","v":""},{"$f":"IF(DE1<>\"\",MAX($A111:DD111)+1,\"\")","v":""},{"$f":"IF(DF1<>\"\",MAX($A111:DE111)+1,\"\")","v":""},{"$f":"IF(DG1<>\"\",MAX($A111:DF111)+1,\"\")","v":""},{"$f":"IF(DH1<>\"\",MAX($A111:DG111)+1,\"\")","v":""},{"$f":"IF(DI1<>\"\",MAX($A111:DH111)+1,\"\")","v":""},{"$f":"IF(DJ1<>\"\",MAX($A111:DI111)+1,\"\")","v":""},{"$f":"IF(DK1<>\"\",MAX($A111:DJ111)+1,\"\")","v":""},{"$f":"IF(DL1<>\"\",MAX($A111:DK111)+1,\"\")","v":""},{"$f":"IF(DM1<>\"\",MAX($A111:DL111)+1,\"\")","v":""},{"$f":"IF(DN1<>\"\",MAX($A111:DM111)+1,\"\")","v":""},{"$f":"IF(DO1<>\"\",MAX($A111:DN111)+1,\"\")","v":""},{"$f":"IF(DP1<>\"\",MAX($A111:DO111)+1,\"\")","v":""},{"$f":"IF(DQ1<>\"\",MAX($A111:DP111)+1,\"\")","v":""},{"$f":"IF(DR1<>\"\",MAX($A111:DQ111)+1,\"\")","v":""},{"$f":"IF(DS1<>\"\",MAX($A111:DR111)+1,\"\")","v":""},{"$f":"IF(DT1<>\"\",MAX($A111:DS111)+1,\"\")","v":""},{"$f":"IF(DU1<>\"\",MAX($A111:DT111)+1,\"\")","v":""},{"$f":"IF(DV1<>\"\",MAX($A111:DU111)+1,\"\")","v":""},{"$f":"IF(DW1<>\"\",MAX($A111:DV111)+1,\"\")","v":""},{"$f":"IF(DX1<>\"\",MAX($A111:DW111)+1,\"\")","v":""},{"$f":"IF(DY1<>\"\",MAX($A111:DX111)+1,\"\")","v":""},{"$f":"IF(DZ1<>\"\",MAX($A111:DY111)+1,\"\")","v":""},{"$f":"IF(EA1<>\"\",MAX($A111:DZ111)+1,\"\")","v":""},{"$f":"IF(EB1<>\"\",MAX($A111:EA111)+1,\"\")","v":""},{"$f":"IF(EC1<>\"\",MAX($A111:EB111)+1,\"\")","v":""},{"$f":"IF(ED1<>\"\",MAX($A111:EC111)+1,\"\")","v":""},{"$f":"IF(EE1<>\"\",MAX($A111:ED111)+1,\"\")","v":""},{"$f":"IF(EF1<>\"\",MAX($A111:EE111)+1,\"\")","v":""},{"$f":"IF(EG1<>\"\",MAX($A111:EF111)+1,\"\")","v":""},{"$f":"IF(EH1<>\"\",MAX($A111:EG111)+1,\"\")","v":""},{"$f":"IF(EI1<>\"\",MAX($A111:EH111)+1,\"\")","v":""},{"$f":"IF(EJ1<>\"\",MAX($A111:EI111)+1,\"\")","v":""},{"$f":"IF(EK1<>\"\",MAX($A111:EJ111)+1,\"\")","v":""},{"$f":"IF(EL1<>\"\",MAX($A111:EK111)+1,\"\")","v":""},{"$f":"IF(EM1<>\"\",MAX($A111:EL111)+1,\"\")","v":""},{"$f":"IF(EN1<>\"\",MAX($A111:EM111)+1,\"\")","v":""},{"$f":"IF(EO1<>\"\",MAX($A111:EN111)+1,\"\")","v":""},{"$f":"IF(EP1<>\"\",MAX($A111:EO111)+1,\"\")","v":""},{"$f":"IF(EQ1<>\"\",MAX($A111:EP111)+1,\"\")","v":""},{"$f":"IF(ER1<>\"\",MAX($A111:EQ111)+1,\"\")","v":""},{"$f":"IF(ES1<>\"\",MAX($A111:ER111)+1,\"\")","v":""},{"$f":"IF(ET1<>\"\",MAX($A111:ES111)+1,\"\")","v":""},{"$f":"IF(EU1<>\"\",MAX($A111:ET111)+1,\"\")","v":""},{"$f":"IF(EV1<>\"\",MAX($A111:EU111)+1,\"\")","v":""},{"$f":"IF(EW1<>\"\",MAX($A111:EV111)+1,\"\")","v":""},{"$f":"IF(EX1<>\"\",MAX($A111:EW111)+1,\"\")","v":""},{"$f":"IF(EY1<>\"\",MAX($A111:EX111)+1,\"\")","v":""},{"$f":"IF(EZ1<>\"\",MAX($A111:EY111)+1,\"\")","v":""},{"$f":"IF(FA1<>\"\",MAX($A111:EZ111)+1,\"\")","v":""},{"$f":"IF(FB1<>\"\",MAX($A111:FA111)+1,\"\")","v":""},{"$f":"IF(FC1<>\"\",MAX($A111:FB111)+1,\"\")","v":""},{"$f":"IF(FD1<>\"\",MAX($A111:FC111)+1,\"\")","v":""},{"$f":"IF(FE1<>\"\",MAX($A111:FD111)+1,\"\")","v":""},{"$f":"IF(FF1<>\"\",MAX($A111:FE111)+1,\"\")","v":""},{"$f":"IF(FG1<>\"\",MAX($A111:FF111)+1,\"\")","v":""},{"$f":"IF(FH1<>\"\",MAX($A111:FG111)+1,\"\")","v":""},{"$f":"IF(FI1<>\"\",MAX($A111:FH111)+1,\"\")","v":""},{"$f":"IF(FJ1<>\"\",MAX($A111:FI111)+1,\"\")","v":""},{"$f":"IF(FK1<>\"\",MAX($A111:FJ111)+1,\"\")","v":""},{"$f":"IF(FL1<>\"\",MAX($A111:FK111)+1,\"\")","v":""},{"$f":"IF(FM1<>\"\",MAX($A111:FL111)+1,\"\")","v":""},{"$f":"IF(FN1<>\"\",MAX($A111:FM111)+1,\"\")","v":""},{"$f":"IF(FO1<>\"\",MAX($A111:FN111)+1,\"\")","v":""},{"$f":"IF(FP1<>\"\",MAX($A111:FO111)+1,\"\")","v":""},{"$f":"IF(FQ1<>\"\",MAX($A111:FP111)+1,\"\")","v":""},{"$f":"IF(FR1<>\"\",MAX($A111:FQ111)+1,\"\")","v":""},{"$f":"IF(FS1<>\"\",MAX($A111:FR111)+1,\"\")","v":""},{"$f":"IF(FT1<>\"\",MAX($A111:FS111)+1,\"\")","v":""},{"$f":"IF(FU1<>\"\",MAX($A111:FT111)+1,\"\")","v":""},{"$f":"IF(FV1<>\"\",MAX($A111:FU111)+1,\"\")","v":""},{"$f":"IF(FW1<>\"\",MAX($A111:FV111)+1,\"\")","v":""},{"$f":"IF(FX1<>\"\",MAX($A111:FW111)+1,\"\")","v":""},{"$f":"IF(FY1<>\"\",MAX($A111:FX111)+1,\"\")","v":""},{"$f":"IF(FZ1<>\"\",MAX($A111:FY111)+1,\"\")","v":""},{"$f":"IF(GA1<>\"\",MAX($A111:FZ111)+1,\"\")","v":""},{"$f":"IF(GB1<>\"\",MAX($A111:GA111)+1,\"\")","v":""},{"$f":"IF(GC1<>\"\",MAX($A111:GB111)+1,\"\")","v":""},{"$f":"IF(GD1<>\"\",MAX($A111:GC111)+1,\"\")","v":""},{"$f":"IF(GE1<>\"\",MAX($A111:GD111)+1,\"\")","v":""},{"$f":"IF(GF1<>\"\",MAX($A111:GE111)+1,\"\")","v":""},{"$f":"IF(GG1<>\"\",MAX($A111:GF111)+1,\"\")","v":""},{"$f":"IF(GH1<>\"\",MAX($A111:GG111)+1,\"\")","v":""},{"$f":"IF(GI1<>\"\",MAX($A111:GH111)+1,\"\")","v":""},{"$f":"IF(GJ1<>\"\",MAX($A111:GI111)+1,\"\")","v":""},{"$f":"IF(GK1<>\"\",MAX($A111:GJ111)+1,\"\")","v":""},{"$f":"IF(GL1<>\"\",MAX($A111:GK111)+1,\"\")","v":""},{"$f":"IF(GM1<>\"\",MAX($A111:GL111)+1,\"\")","v":""},{"$f":"IF(GN1<>\"\",MAX($A111:GM111)+1,\"\")","v":""},{"$f":"IF(GO1<>\"\",MAX($A111:GN111)+1,\"\")","v":""},{"$f":"IF(GP1<>\"\",MAX($A111:GO111)+1,\"\")","v":""},{"$f":"IF(GQ1<>\"\",MAX($A111:GP111)+1,\"\")","v":""},{"$f":"IF(GR1<>\"\",MAX($A111:GQ111)+1,\"\")","v":""},{"$f":"IF(GS1<>\"\",MAX($A111:GR111)+1,\"\")","v":""}]

{"sheet":"Index","index":8,"n_rows":383,"n_cols":201,"rows_kept":383,"cut":false,"hidden":false,"merged":[]}
["Month","Flat","I2","I3"]
["Start Date","2000-01-01","2007-01-01","2007-01-01"]
[1,1,1,1]
[2,1,{"$f":"C3*1.006434","v":1.0064340000000001},1]
[3,1,{"$f":"C4*1.006434","v":1.0129093963560001},1]
[4,1,1.0194264554121546,1]
[5,1,1.0259854452262764,1]
[6,1,1.0325866355808624,1]
[7,1,1.0392302979941896,1]
[8,1,1.0459167057314842,1]
[9,1,{"$f":"C10*1.006434","v":1.0526461338161606},1]
[10,1,1.0594188590411338,1]
[11,1,1.0662351599802045,1]
[12,1,1.0730953169995172,1]
[13,1,1.0799996122690922,1]
[14,1,1.0869483297744316,1]
[15,1,1.0939417553282003,1]
[16,1,1.100980176581982,1]
[17,1,1.1080638830381104,1]
[18,1,1.1151931660615777,1]
[19,1,1.1223683188920179,1]
[20,1,1.1295896366557692,1]
[21,1,1.1368574163780125,1]
[22,1,1.1441719569949886,1]
[23,1,1.1515335593662945,1]
[24,1,1.1589425262872572,1]
[25,1,1.1663991625013894,1]
[26,1,1.1739037747129235,1]
[27,1,1.1814566715994266,1]
[28,1,1.1890581638244972,1]
[29,1,1.1967085640505442,1]
[30,1,1.2044081869516454,1]
[31,1,1.2121573492264923,1]
[32,1,1.2199563696114157,1]
[33,1,1.2278055688934957,1]
[34,1,1.2357052699237565,1]
[35,1,1.2436557976304461,1]
[36,1,1.2516574790324004,1]
[37,1,1.2597106432524949,1]
[38,1,1.2678156215311815,1]
[39,1,1.2759727472401132,1]
[40,1,1.2841823558958563,1]
[41,1,1.2924447851736902,1]
[42,1,1.3007603749214978,1]
[43,1,1.3091294671737428,1]
[44,1,1.3175524061655388,1]
[45,1,1.3260295383468079,1]
[46,1,1.3345612123965314,1]
[47,1,1.3431477792370907,1]
[48,1,1.3517895920487022,1]
[49,1,1.3604870062839436,1]
[50,1,1.3692403796823744,1]
[51,1,1.3780500722852509,1]
[52,1,1.3869164464503343,1]
[53,1,1.3958398668667957,1]
[54,1,1.4048207005702167,1]
[55,1,1.4138593169576856,1]
[56,1,1.4229560878029914,1]
[57,1,1.432111387271916,1]
[58,1,1.4413255919376236,1]
[59,1,1.4505990807961502,1]
[60,1,1.4599322352819928,1]
[61,1,1.4693254392837971,1]
[62,1,1.4787790791601492,1]
[63,1,1.4882935437554656,1]
[64,1,1.4978692244159884,1]
[65,1,1.5075065150058808,1]
[66,1,1.5172058119234288,1]
[67,1,{"$f":"C68*1.006434","v":1.5269675141173442},1]
[68,1,1.5367920231031753,1]
[69,1,1.5466797429798211,1]
[70,1,1.5566310804461534,1]
[71,1,1.566646444817744,1]
[72,1,1.5767262480437014,1]
[73,1,1.5868709047236147,1]
[74,1,1.5970808321246066,1]
[75,1,1.6073564501984965,1]
[76,1,1.6176981815990736,1]
[77,1,1.6281064516994821,1]
[78,1,1.6385816886097166,1]
[79,1,1.6491243231942316,1]
[80,1,1.6597347890896634,1]
[81,1,1.6704135227226664,1]
[82,1,1.6811609633278641,1]
[83,1,1.6919775529659158,1]
[84,1,1.7028637365416985,1]
[85,1,1.713819961822608,1]
[86,1,1.7248466794569748,1]
[87,1,1.7359443429926011,1]
[88,1,1.7471134088954157,1]
[89,1,1.7583543365682488,1]
[90,1,1.769667588369729,1]
[91,1,1.7810536296332999,1]
[92,1,1.7925129286863606,1]
[93,1,1.8040459568695286,1]
[94,1,1.8156531885560272,1]
[95,1,1.8273351011711967,1]
[96,1,1.8390921752121323,1]
[97,1,1.8509248942674472,1]
[98,1,1.8628337450371641,1]
[99,1,1.8748192173527334,1]
[100,1,1.8868818041971809,1]
[101,1,1.8990220017253856,1]
[102,1,1.9112403092844867,1]
[103,1,1.9235372294344233,1]
[104,1,1.9359132679686044,1]
[105,1,1.9483689339347146,1]
[106,1,1.9609047396556507,1]
[107,1,1.9735212007505953,1]
[108,1,1.9862188361562247,1]
[109,1,1.998998168148054,1]
[110,1,2.0118597223619186,1]
[111,1,2.0248040278155952,1]
[112,1,2.037831616930561,1]
[113,1,2.0509430255538925,1]
[114,1,2.0641387929803066,1]
[115,1,2.0774194619743418,1]
[116,1,2.0907855787926848,1]
[117,1,2.1042376932066369,1]
[118,1,2.1177763585247287,1]
[119,1,2.1314021316154768,1]
[120,1,2.1451155729302909,1]
[121,1,2.1589172465265243,{"$f":"D122*(1.03)^(1/12)","v":1.0024662697723037}]
[122,1,2.1728077200906761,{"$f":"D123*(1.03)^(1/12)","v":1.0049386220311971}]
[123,1,2.1867875649617399,1.0074170717777331]
[124,1,2.200857356154704,1.0099016340499611]
[125,1,2.2150176723842034,1.0123923239230186]
[126,1,2.2292690960883235,1.0148891565092222]
[127,1,2.2436122134525558,1.0173921469581597]
[128,1,2.2580476144339094,1.0199013104567818]
[129,1,2.2725758927851771,1.0224166622294943]
[130,1,2.287197646079357,1.0249382175382507]
[131,1,{"$f":"C132*1.006434","v":2.3019134757342319},1.0274659916826441]
[132,1,2.3167239870371059,1.0300000000000009]
[133,1,2.3316297891697029,1.0325402578654737]
[134,1,2.346631495233221,1.035086780692134]
[135,1,2.3617297222735516,1.0376395839310661]
[136,1,2.37692509130666,1.0401986830714611]
[137,1,2.3922182273441273,1.0427640936407103]
[138,1,2.4076097594188597,1.0453358312045]
[139,1,2.4231003206109607,1.0479139113669056]
[140,1,2.4386905480737719,1.0504983497704863]
[141,1,2.4543810830600785,1.05308916209638]
[142,1,2.470172570948487,1.055686364064399]
[143,1,2.4860656612699699,1.0582899714331242]
[144,1,2.5020610077345808,1.060900000000002]
[145,1,2.5181592682583451,1.0635164656014389]
[146,1,2.5343611049903196,1.066139384112899]
[147,1,2.5506671843398276,1.0687687714489991]
[148,1,2.5670781770038702,1.071404643563606]
[149,1,2.5835947579947134,1.0740470164499327]
[150,1,2.6002176066676514,1.0766959061406363]
[151,1,2.6169474067489511,1.0793513287079139]
[152,1,2.6337848463639739,1.0820133002636021]
[153,1,2.6507306180654799,1.0846818369592728]
[154,1,2.6677854188621133,1.0873569549863322]
[155,1,2.6849499502470722,1.0900386705761191]
[156,1,2.7022249182269618,1.0927270000000031]
[157,1,2.7196110333508341,1.0954219595694832]
[158,1,2.7371090107394136,1.0981235656362871]
[159,1,2.7547195701145113,1.1008318345924701]
[160,1,2.7724434358286283,1.1035467828705152]
[161,1,2.7902813368947497,1.1062684269434317]
[162,1,2.8082340070163307,1.1089967833248562]
[163,1,2.8263021846174738,1.1117318685691524]
[164,1,2.8444866128733026,1.1144736992715112]
[165,1,2.8627880397405296,1.1172222920680519]
[166,1,2.8812072179882202,1.1199776636359231]
[167,1,2.8997449052287565,1.1227398306934038]
[168,1,2.9184018639489984,1.1255088100000044]
[169,1,2.9371788615416463,1.1282846183565689]
[170,1,2.9560766703368055,1.131067272605377]
[171,1,2.9750960676337526,1.1338567896302456]
[172,1,2.9942378357329082,1.136653186356632]
[173,1,3.0135027619680139,1.1394564797517361]
[174,1,3.0328916387385161,1.1422666868246034]
[175,1,3.0524052635421599,1.1450838246262285]
[176,1,3.0720444390077901,1.1479079102496581]
[177,1,3.0918099729283663,1.1507389608300951]
[178,1,3.1117026782941877,1.1535769935450024]
[179,1,3.1317233733263325,1.1564220256142075]
[180,1,3.1518728815103145,1.1592740743000061]
[181,1,3.1721520316299521,1.1621331569072675]
[182,1,3.1925616578014595,1.1649992907835398]
[183,1,3.2131025995077542,1.1678724933191544]
[184,1,3.2337757016329873,1.1707527819473325]
[185,1,3.254581814497294,1.1736401741442897]
[186,1,3.2755217938917696,{"$f":"D187*(1.03)^(1/12)","v":1.176534687429343}]
[187,1,3.2965965011136693,1.1794363393650167]
[188,1,3.3178068030018348,1.1823451475571491]
[189,1,3.3391535719723486,1.1852611296549993]
[190,1,3.3606376860544187,1.1881843033513539]
[191,1,3.3822600289264928,1.1911146863826352]
[192,1,3.4040214899526062,1.1940522965290077]
[193,1,3.4259229642189615,1.1969971516144871]
[194,1,3.4479653525707463,1.1999492695070475]
[195,1,{"$f":"C196*1.006434","v":3.4701495616491869},1.2029086681187307]
[196,1,3.4924765039288381,1.2058753654057539]
[197,1,3.5149470977551163,1.2088493793686197]
[198,1,3.5375622673820728,1.2118307280522247]
[199,1,3.5603229430104091,1.2148194295459687]
[200,1,3.5832300608257381,1.217815501983865]
[201,1,3.6062845630370912,1.2208189635446507]
[202,1,3.6294873979156721,1.2238298324518959]
[203,1,3.6528395198338619,1.2268481269741156]
[204,1,3.676341889304473,1.2298738654248793]
[205,1,3.699995473020258,1.2329070661629229]
[206,1,3.7238012438936705,1.2359477475922602]
[207,1,3.7477601810968824,1.2389959281622938]
[208,1,3.7718732701020601,1.2420516263679278]
[209,1,3.796141502721897,1.2451148607496796]
[210,1,3.8205658771504099,1.2481856498937927]
[211,1,3.8451473980039959,1.2512640124323489]
[212,1,3.8698870763627538,1.2543499670433822]
[213,1,3.8947859298120719,1.2574435324509914]
[214,1,3.919844982484483,1.260544727425454]
[215,1,3.9450652651017886,1.2636535707833401]
[216,1,3.9704478150174536,1.2667700813876266]
[217,1,3.995993676259276,1.2698942781478115]
[218,1,4.0217038995723282,1.2730261800200289]
[219,1,4.0475795424621772,1.2761658060071635]
[220,1,4.0736216692383787,1.2793131751589666]
[221,1,4.0998313510582589,1.2824683065721709]
[222,1,4.1262096659709684,1.2856312193906074]
[223,1,4.1527576989618256,1.2888019328053204]
[224,1,4.1794765419969462,1.2919804660546848]
[225,1,4.2063672940681549,1.2951668384245223]
[226,1,4.23343106123819,1.2983610692482188]
[227,1,4.2606689566861968,1.3015631779068415]
[228,1,4.2880821007535159,1.3047731838292567]
[229,1,4.3156716209897645,1.3079911064922471]
[230,1,4.3434386521992128,1.3112169654206309]
[231,1,4.3713843364874627,1.3144507801873797]
[232,1,4.3995098233084233,1.3176925704137368]
[233,1,4.4278162695115899,1.3209423557693374]
[234,1,4.4563048393896274,1.3242001559723269]
[235,1,4.4849767047262601,1.3274659907894812]
[236,1,4.5138330448444695,1.3307398800363266]
[237,1,4.5428750466549994,1.3340218435772593]
[238,1,4.5721039047051777,1.3373119013256667]
[239,1,4.6015208212280507,1.3406100732440482]
[240,1,4.6311270061918322,1.3439163793441358]
[241,1,4.6609236773496709,1.3472308396870161]
[242,1,4.6909120602897394,1.3505534743832515]
[243,1,4.7210933884856434,1.3538843035930026]
[244,1,4.7514689033471607,1.3572233475261504]
[245,1,4.7820398542712965,1.3605706264424189]
[246,1,4.8128074986936786,1.3639261606514981]
[247,1,4.8437731021402737,1.3672899705131671]
[248,1,4.8749379382794444,1.3706620764374178]
[249,1,4.9063032889743345,1.3740424988845783]
[250,1,4.9378704443355961,{"$f":"D251*(1.03)^(1/12)","v":1.377431258365438}]
[251,1,4.9696407027744511,1.3808283754413708]
[252,1,5.0016153710561024,1.384233870724461]
[253,1,5.0337957643534779,1.3876477648776278]
[254,1,5.0661832063013286,1.3910700786147503]
[255,1,5.0987790290506716,1.3945008327007939]
[256,1,5.1315845733235843,1.3979400479519362]
[257,1,5.1646011884683487,1.4013877452356929]
[258,1,5.1978302325149546,1.4048439454710444]
[259,1,{"$f":"C260*1.006434","v":5.2312730722309562},1.4083086696285636]
[260,1,5.2649310831776903,1.4117819387305417]
[261,1,5.2988056497668561,1.4152637738511171]
[262,1,5.3328981653174559,1.4187541961164025]
[263,1,5.3672100321131087,1.4222532267046135]
[264,1,5.4017426614597248,1.4257608868461964]
[265,1,5.4364974737435565,1.429277197823958]
[266,1,5.471475898489623,1.4328021809731941]
[267,1,5.5066793744205054,1.436335857681819]
[268,1,5.5421093495155276,1.4398782493904956]
[269,1,5.5777672810703107,1.4434293775927649]
[270,1,5.613654635756717,1.4469892638351771]
[271,1,5.6497728896831756,1.4505579297174218]
[272,1,5.686123528455397,1.4541353968924593]
[273,1,5.7227080472374796,1.4577216870666521]
[274,1,5.7595279508134061,1.461316821999896]
[275,1,5.7965847536489399,1.4649208235057531]
[276,1,5.8338799799539176,1.4685337134515837]
[277,1,5.871415163744941,1.4721555137586781]
[278,1,5.9091918489084758,1.4757862464023914]
[279,1,5.9472115892643531,1.4794259334122752]
[280,1,5.9854759486296807,1.4830745968722121]
[281,1,6.0239865008831641,1.4867322589205496]
[282,1,6.062744830029847,1.4903989417502341]
[283,1,6.1017525302662596,1.494074667608946]
[284,1,6.1410112060459934,1.4977594587992347]
[285,1,6.1805224721456939,1.5014533376786532]
[286,1,6.2202879537314795,1.5051563266598946]
[287,1,6.2603092864257883,1.5088684482109276]
[288,1,6.3005881163746524,1.512589724855133]
[289,1,6.3411261003154076,1.5163201791714405]
[290,1,6.3819249056448371,1.5200598337944651]
[291,1,6.422986210487756,1.5238087114146452]
[292,1,6.4643117037660343,1.5275668347783802]
[293,1,6.5059030852680655,1.5313342266881678]
[294,1,6.5477620657186808,1.5351109100027429]
[295,1,6.5898903668495148,1.5388969076372163]
[296,1,6.6322897214698253,1.5426922425632137]
[297,1,6.6749618735377627,1.5464969378090148]
[298,1,6.7179085782321053,1.5503110164596934]
[299,1,6.7611316020244514,1.5541345016572574]
[300,1,6.8046327227518768,1.5579674166007889]
[301,1,6.8484137296900629,1.5618097845465855]
[302,1,6.8924764236268894,1.565661628808301]
[303,1,6.9368226169365048,1.5695229727570865]
[304,1,6.9814541336538749,1.5733938398217335]
[305,1,7.0263728095498044,1.5772742534888147]
[306,1,7.071580492206448,1.581164237302827]
[307,1,7.1170790410933042,1.5850638148663345]
[308,1,7.1628703276436987,1.5889730098401118]
[309,1,7.2089562353317582,1.5928918459432868]
[310,1,7.2553386597498832,1.5968203469534858]
[311,1,7.3020195086867146,1.6007585367069768]
[312,1,7.349000702205605,1.6047064390988142]
[313,1,7.396284172723596,1.6086640780829846]
[314,1,7.4438718650908999,{"$f":"D315*(1.03)^(1/12)","v":1.6126314776725514}]
[315,1,7.491765736670895,1.6166086619398006]
[316,1,7.5399677574206363,1.6205956550163869]
[317,1,7.5884799099718814,1.6245924810934804]
[318,1,7.6373041897126406,1.6285991644219131]
[319,1,7.686442604869252,1.632615729312326]
[320,1,7.7358971765889812,1.6366422001353165]
[321,1,7.7856699390231547,1.6406786013215868]
[322,1,7.8357629394108299,1.6447249573620917]
[323,1,{"$f":"C324*1.006434","v":7.8861782381629997},1.6487812928081873]
[324,1,7.9369179089473407,1.65284763227178]
[325,1,7.9879840387735079,1.6569240004254757]
[326,1,8.0393787280789777,1.6610104220027295]
[327,1,8.0911040908154384,1.6651069217979964]
[328,1,8.1431622545357456,1.6692135246668804]
[329,1,8.1955553604814284,1.6733302555262868]
[330,1,8.2482855636707662,1.6774571393545725]
[331,1,8.3013550329874235,1.6815942011916978]
[332,1,8.3547659512696644,1.6857414661393779]
[333,1,8.4085205154001343,1.6898989593612364]
[334,1,8.4626209363962186,1.6940667060829564]
[335,1,8.5170694395009932,1.6982447315924349]
[336,1,8.5718682642747428,1.7024330612399354]
[337,1,8.6270196646870865,1.706631720438242]
[338,1,8.6825259092096836,1.7108407346628134]
[339,1,8.7383892809095389,1.7150601294519381]
[340,1,8.7946120775429115,1.7192899304068887]
[341,1,8.8511966116498222,1.7235301631920774]
[342,1,8.9081452106491774,1.7277808535352117]
[343,1,8.9654602169344955,1.7320420272274506]
[344,1,9.0231439879702524,1.7363137101235613]
[345,1,9.0811988963888535,1.7405959281420755]
[346,1,9.1396273300882207,1.7448887072654473]
[347,1,9.1984316923300096,1.7491920735402102]
[348,1,9.2576144018384614,1.7535060530771356]
[349,1,9.3171778928998901,1.7578306720513912]
[350,1,9.3771246154628081,1.7621659567026999]
[351,1,9.4374570352386957,1.7665119333354984]
[352,1,9.4981776338034223,1.7708686283190975]
[353,1,9.5592889086993136,1.7752360680878418]
[354,1,9.6207933735378859,1.7796142791412701]
[355,1,9.6826935581032298,1.7840032880442762]
[356,1,9.7449920084560659,1.7884031214272702]
[357,1,9.8076912870384731,1.7928138059863399]
[358,1,9.8707939727792784,1.7972353684834128]
[359,1,9.9343026612001406,1.8016678357464184]
[360,1,9.9982199645223027,1.8061112346694517]
[]
[]
[]
[]
[]
[]
[]
[]
[]
[]
[]
[]
[]
[]
[]
[]
[]
[]
[]
[null,"DO NOT CHANGE"]
["Intrim Step ",{"$f":"IF(B1<>\"\",MAX($A383:A383,)+1,\"\")","v":1},{"$f":"IF(C1<>\"\",MAX($A383:B383,)+1,\"\")","v":2},{"$f":"IF(D1<>\"\",MAX($A383:C383,)+1,\"\")","v":3},{"$f":"IF(E1<>\"\",MAX($A383:D383,)+1,\"\")","v":""},{"$f":"IF(F1<>\"\",MAX($A383:E383,)+1,\"\")","v":""},{"$f":"IF(G1<>\"\",MAX($A383:F383,)+1,\"\")","v":""},{"$f":"IF(H1<>\"\",MAX($A383:G383,)+1,\"\")","v":""},{"$f":"IF(I1<>\"\",MAX($A383:H383,)+1,\"\")","v":""},{"$f":"IF(J1<>\"\",MAX($A383:I383,)+1,\"\")","v":""},{"$f":"IF(K1<>\"\",MAX($A383:J383,)+1,\"\")","v":""},{"$f":"IF(L1<>\"\",MAX($A383:K383,)+1,\"\")","v":""},{"$f":"IF(M1<>\"\",MAX($A383:L383,)+1,\"\")","v":""},{"$f":"IF(N1<>\"\",MAX($A383:M383,)+1,\"\")","v":""},{"$f":"IF(O1<>\"\",MAX($A383:N383,)+1,\"\")","v":""},{"$f":"IF(P1<>\"\",MAX($A383:O383,)+1,\"\")","v":""},{"$f":"IF(Q1<>\"\",MAX($A383:P383,)+1,\"\")","v":""},{"$f":"IF(R1<>\"\",MAX($A383:Q383,)+1,\"\")","v":""},{"$f":"IF(S1<>\"\",MAX($A383:R383,)+1,\"\")","v":""},{"$f":"IF(T1<>\"\",MAX($A383:S383,)+1,\"\")","v":""},{"$f":"IF(U1<>\"\",MAX($A383:T383,)+1,\"\")","v":""},{"$f":"IF(V1<>\"\",MAX($A383:U383,)+1,\"\")","v":""},{"$f":"IF(W1<>\"\",MAX($A383:V383,)+1,\"\")","v":""},{"$f":"IF(X1<>\"\",MAX($A383:W383,)+1,\"\")","v":""},{"$f":"IF(Y1<>\"\",MAX($A383:X383,)+1,\"\")","v":""},{"$f":"IF(Z1<>\"\",MAX($A383:Y383,)+1,\"\")","v":""},{"$f":"IF(AA1<>\"\",MAX($A383:Z383,)+1,\"\")","v":""},{"$f":"IF(AB1<>\"\",MAX($A383:AA383,)+1,\"\")","v":""},{"$f":"IF(AC1<>\"\",MAX($A383:AB383,)+1,\"\")","v":""},{"$f":"IF(AD1<>\"\",MAX($A383:AC383,)+1,\"\")","v":""},{"$f":"IF(AE1<>\"\",MAX($A383:AD383,)+1,\"\")","v":""},{"$f":"IF(AF1<>\"\",MAX($A383:AE383,)+1,\"\")","v":""},{"$f":"IF(AG1<>\"\",MAX($A383:AF383,)+1,\"\")","v":""},{"$f":"IF(AH1<>\"\",MAX($A383:AG383,)+1,\"\")","v":""},{"$f":"IF(AI1<>\"\",MAX($A383:AH383,)+1,\"\")","v":""},{"$f":"IF(AJ1<>\"\",MAX($A383:AI383,)+1,\"\")","v":""},{"$f":"IF(AK1<>\"\",MAX($A383:AJ383,)+1,\"\")","v":""},{"$f":"IF(AL1<>\"\",MAX($A383:AK383,)+1,\"\")","v":""},{"$f":"IF(AM1<>\"\",MAX($A383:AL383,)+1,\"\")","v":""},{"$f":"IF(AN1<>\"\",MAX($A383:AM383,)+1,\"\")","v":""},{"$f":"IF(AO1<>\"\",MAX($A383:AN383,)+1,\"\")","v":""},{"$f":"IF(AP1<>\"\",MAX($A383:AO383,)+1,\"\")","v":""},{"$f":"IF(AQ1<>\"\",MAX($A383:AP383,)+1,\"\")","v":""},{"$f":"IF(AR1<>\"\",MAX($A383:AQ383,)+1,\"\")","v":""},{"$f":"IF(AS1<>\"\",MAX($A383:AR383,)+1,\"\")","v":""},{"$f":"IF(AT1<>\"\",MAX($A383:AS383,)+1,\"\")","v":""},{"$f":"IF(AU1<>\"\",MAX($A383:AT383,)+1,\"\")","v":""},{"$f":"IF(AV1<>\"\",MAX($A383:AU383,)+1,\"\")","v":""},{"$f":"IF(AW1<>\"\",MAX($A383:AV383,)+1,\"\")","v":""},{"$f":"IF(AX1<>\"\",MAX($A383:AW383,)+1,\"\")","v":""},{"$f":"IF(AY1<>\"\",MAX($A383:AX383,)+1,\"\")","v":""},{"$f":"IF(AZ1<>\"\",MAX($A383:AY383,)+1,\"\")","v":""},{"$f":"IF(BA1<>\"\",MAX($A383:AZ383,)+1,\"\")","v":""},{"$f":"IF(BB1<>\"\",MAX($A383:BA383,)+1,\"\")","v":""},{"$f":"IF(BC1<>\"\",MAX($A383:BB383,)+1,\"\")","v":""},{"$f":"IF(BD1<>\"\",MAX($A383:BC383,)+1,\"\")","v":""},{"$f":"IF(BE1<>\"\",MAX($A383:BD383,)+1,\"\")","v":""},{"$f":"IF(BF1<>\"\",MAX($A383:BE383,)+1,\"\")","v":""},{"$f":"IF(BG1<>\"\",MAX($A383:BF383,)+1,\"\")","v":""},{"$f":"IF(BH1<>\"\",MAX($A383:BG383,)+1,\"\")","v":""},{"$f":"IF(BI1<>\"\",MAX($A383:BH383,)+1,\"\")","v":""},{"$f":"IF(BJ1<>\"\",MAX($A383:BI383,)+1,\"\")","v":""},{"$f":"IF(BK1<>\"\",MAX($A383:BJ383,)+1,\"\")","v":""},{"$f":"IF(BL1<>\"\",MAX($A383:BK383,)+1,\"\")","v":""},{"$f":"IF(BM1<>\"\",MAX($A383:BL383,)+1,\"\")","v":""},{"$f":"IF(BN1<>\"\",MAX($A383:BM383,)+1,\"\")","v":""},{"$f":"IF(BO1<>\"\",MAX($A383:BN383,)+1,\"\")","v":""},{"$f":"IF(BP1<>\"\",MAX($A383:BO383,)+1,\"\")","v":""},{"$f":"IF(BQ1<>\"\",MAX($A383:BP383,)+1,\"\")","v":""},{"$f":"IF(BR1<>\"\",MAX($A383:BQ383,)+1,\"\")","v":""},{"$f":"IF(BS1<>\"\",MAX($A383:BR383,)+1,\"\")","v":""},{"$f":"IF(BT1<>\"\",MAX($A383:BS383,)+1,\"\")","v":""},{"$f":"IF(BU1<>\"\",MAX($A383:BT383,)+1,\"\")","v":""},{"$f":"IF(BV1<>\"\",MAX($A383:BU383,)+1,\"\")","v":""},{"$f":"IF(BW1<>\"\",MAX($A383:BV383,)+1,\"\")","v":""},{"$f":"IF(BX1<>\"\",MAX($A383:BW383,)+1,\"\")","v":""},{"$f":"IF(BY1<>\"\",MAX($A383:BX383,)+1,\"\")","v":""},{"$f":"IF(BZ1<>\"\",MAX($A383:BY383,)+1,\"\")","v":""},{"$f":"IF(CA1<>\"\",MAX($A383:BZ383,)+1,\"\")","v":""},{"$f":"IF(CB1<>\"\",MAX($A383:CA383,)+1,\"\")","v":""},{"$f":"IF(CC1<>\"\",MAX($A383:CB383,)+1,\"\")","v":""},{"$f":"IF(CD1<>\"\",MAX($A383:CC383,)+1,\"\")","v":""},{"$f":"IF(CE1<>\"\",MAX($A383:CD383,)+1,\"\")","v":""},{"$f":"IF(CF1<>\"\",MAX($A383:CE383,)+1,\"\")","v":""},{"$f":"IF(CG1<>\"\",MAX($A383:CF383,)+1,\"\")","v":""},{"$f":"IF(CH1<>\"\",MAX($A383:CG383,)+1,\"\")","v":""},{"$f":"IF(CI1<>\"\",MAX($A383:CH383,)+1,\"\")","v":""},{"$f":"IF(CJ1<>\"\",MAX($A383:CI383,)+1,\"\")","v":""},{"$f":"IF(CK1<>\"\",MAX($A383:CJ383,)+1,\"\")","v":""},{"$f":"IF(CL1<>\"\",MAX($A383:CK383,)+1,\"\")","v":""},{"$f":"IF(CM1<>\"\",MAX($A383:CL383,)+1,\"\")","v":""},{"$f":"IF(CN1<>\"\",MAX($A383:CM383,)+1,\"\")","v":""},{"$f":"IF(CO1<>\"\",MAX($A383:CN383,)+1,\"\")","v":""},{"$f":"IF(CP1<>\"\",MAX($A383:CO383,)+1,\"\")","v":""},{"$f":"IF(CQ1<>\"\",MAX($A383:CP383,)+1,\"\")","v":""},{"$f":"IF(CR1<>\"\",MAX($A383:CQ383,)+1,\"\")","v":""},{"$f":"IF(CS1<>\"\",MAX($A383:CR383,)+1,\"\")","v":""},{"$f":"IF(CT1<>\"\",MAX($A383:CS383,)+1,\"\")","v":""},{"$f":"IF(CU1<>\"\",MAX($A383:CT383,)+1,\"\")","v":""},{"$f":"IF(CV1<>\"\",MAX($A383:CU383,)+1,\"\")","v":""},{"$f":"IF(CW1<>\"\",MAX($A383:CV383,)+1,\"\")","v":""},{"$f":"IF(CX274<>\"\",MAX($A383:CW383)+1,\"\")","v":""},{"$f":"IF(CY274<>\"\",MAX($A383:CX383)+1,\"\")","v":""},{"$f":"IF(CZ274<>\"\",MAX($A383:CY383)+1,\"\")","v":""},{"$f":"IF(DA274<>\"\",MAX($A383:CZ383)+1,\"\")","v":""},{"$f":"IF(DB274<>\"\",MAX($A383:DA383)+1,\"\")","v":""},{"$f":"IF(DC274<>\"\",MAX($A383:DB383)+1,\"\")","v":""},{"$f":"IF(DD274<>\"\",MAX($A383:DC383)+1,\"\")","v":""},{"$f":"IF(DE274<>\"\",MAX($A383:DD383)+1,\"\")","v":""},{"$f":"IF(DF274<>\"\",MAX($A383:DE383)+1,\"\")","v":""},{"$f":"IF(DG274<>\"\",MAX($A383:DF383)+1,\"\")","v":""},{"$f":"IF(DH274<>\"\",MAX($A383:DG383)+1,\"\")","v":""},{"$f":"IF(DI274<>\"\",MAX($A383:DH383)+1,\"\")","v":""},{"$f":"IF(DJ274<>\"\",MAX($A383:DI383)+1,\"\")","v":""},{"$f":"IF(DK274<>\"\",MAX($A383:DJ383)+1,\"\")","v":""},{"$f":"IF(DL274<>\"\",MAX($A383:DK383)+1,\"\")","v":""},{"$f":"IF(DM274<>\"\",MAX($A383:DL383)+1,\"\")","v":""},{"$f":"IF(DN274<>\"\",MAX($A383:DM383)+1,\"\")","v":""},{"$f":"IF(DO274<>\"\",MAX($A383:DN383)+1,\"\")","v":""},{"$f":"IF(DP274<>\"\",MAX($A383:DO383)+1,\"\")","v":""},{"$f":"IF(DQ274<>\"\",MAX($A383:DP383)+1,\"\")","v":""},{"$f":"IF(DR274<>\"\",MAX($A383:DQ383)+1,\"\")","v":""},{"$f":"IF(DS274<>\"\",MAX($A383:DR383)+1,\"\")","v":""},{"$f":"IF(DT274<>\"\",MAX($A383:DS383)+1,\"\")","v":""},{"$f":"IF(DU274<>\"\",MAX($A383:DT383)+1,\"\")","v":""},{"$f":"IF(DV274<>\"\",MAX($A383:DU383)+1,\"\")","v":""},{"$f":"IF(DW274<>\"\",MAX($A383:DV383)+1,\"\")","v":""},{"$f":"IF(DX274<>\"\",MAX($A383:DW383)+1,\"\")","v":""},{"$f":"IF(DY274<>\"\",MAX($A383:DX383)+1,\"\")","v":""},{"$f":"IF(DZ274<>\"\",MAX($A383:DY383)+1,\"\")","v":""},{"$f":"IF(EA274<>\"\",MAX($A383:DZ383)+1,\"\")","v":""},{"$f":"IF(EB274<>\"\",MAX($A383:EA383)+1,\"\")","v":""},{"$f":"IF(EC274<>\"\",MAX($A383:EB383)+1,\"\")","v":""},{"$f":"IF(ED274<>\"\",MAX($A383:EC383)+1,\"\")","v":""},{"$f":"IF(EE274<>\"\",MAX($A383:ED383)+1,\"\")","v":""},{"$f":"IF(EF274<>\"\",MAX($A383:EE383)+1,\"\")","v":""},{"$f":"IF(EG274<>\"\",MAX($A383:EF383)+1,\"\")","v":""},{"$f":"IF(EH274<>\"\",MAX($A383:EG383)+1,\"\")","v":""},{"$f":"IF(EI274<>\"\",MAX($A383:EH383)+1,\"\")","v":""},{"$f":"IF(EJ274<>\"\",MAX($A383:EI383)+1,\"\")","v":""},{"$f":"IF(EK274<>\"\",MAX($A383:EJ383)+1,\"\")","v":""},{"$f":"IF(EL274<>\"\",MAX($A383:EK383)+1,\"\")","v":""},{"$f":"IF(EM274<>\"\",MAX($A383:EL383)+1,\"\")","v":""},{"$f":"IF(EN274<>\"\",MAX($A383:EM383)+1,\"\")","v":""},{"$f":"IF(EO274<>\"\",MAX($A383:EN383)+1,\"\")","v":""},{"$f":"IF(EP274<>\"\",MAX($A383:EO383)+1,\"\")","v":""},{"$f":"IF(EQ274<>\"\",MAX($A383:EP383)+1,\"\")","v":""},{"$f":"IF(ER274<>\"\",MAX($A383:EQ383)+1,\"\")","v":""},{"$f":"IF(ES274<>\"\",MAX($A383:ER383)+1,\"\")","v":""},{"$f":"IF(ET274<>\"\",MAX($A383:ES383)+1,\"\")","v":""},{"$f":"IF(EU274<>\"\",MAX($A383:ET383)+1,\"\")","v":""},{"$f":"IF(EV274<>\"\",MAX($A383:EU383)+1,\"\")","v":""},{"$f":"IF(EW274<>\"\",MAX($A383:EV383)+1,\"\")","v":""},{"$f":"IF(EX274<>\"\",MAX($A383:EW383)+1,\"\")","v":""},{"$f":"IF(EY274<>\"\",MAX($A383:EX383)+1,\"\")","v":""},{"$f":"IF(EZ274<>\"\",MAX($A383:EY383)+1,\"\")","v":""},{"$f":"IF(FA274<>\"\",MAX($A383:EZ383)+1,\"\")","v":""},{"$f":"IF(FB274<>\"\",MAX($A383:FA383)+1,\"\")","v":""},{"$f":"IF(FC274<>\"\",MAX($A383:FB383)+1,\"\")","v":""},{"$f":"IF(FD274<>\"\",MAX($A383:FC383)+1,\"\")","v":""},{"$f":"IF(FE274<>\"\",MAX($A383:FD383)+1,\"\")","v":""},{"$f":"IF(FF274<>\"\",MAX($A383:FE383)+1,\"\")","v":""},{"$f":"IF(FG274<>\"\",MAX($A383:FF383)+1,\"\")","v":""},{"$f":"IF(FH274<>\"\",MAX($A383:FG383)+1,\"\")","v":""},{"$f":"IF(FI274<>\"\",MAX($A383:FH383)+1,\"\")","v":""},{"$f":"IF(FJ274<>\"\",MAX($A383:FI383)+1,\"\")","v":""},{"$f":"IF(FK274<>\"\",MAX($A383:FJ383)+1,\"\")","v":""},{"$f":"IF(FL274<>\"\",MAX($A383:FK383)+1,\"\")","v":""},{"$f":"IF(FM274<>\"\",MAX($A383:FL383)+1,\"\")","v":""},{"$f":"IF(FN274<>\"\",MAX($A383:FM383)+1,\"\")","v":""},{"$f":"IF(FO274<>\"\",MAX($A383:FN383)+1,\"\")","v":""},{"$f":"IF(FP274<>\"\",MAX($A383:FO383)+1,\"\")","v":""},{"$f":"IF(FQ274<>\"\",MAX($A383:FP383)+1,\"\")","v":""},{"$f":"IF(FR274<>\"\",MAX($A383:FQ383)+1,\"\")","v":""},{"$f":"IF(FS274<>\"\",MAX($A383:FR383)+1,\"\")","v":""},{"$f":"IF(FT274<>\"\",MAX($A383:FS383)+1,\"\")","v":""},{"$f":"IF(FU274<>\"\",MAX($A383:FT383)+1,\"\")","v":""},{"$f":"IF(FV274<>\"\",MAX($A383:FU383)+1,\"\")","v":""},{"$f":"IF(FW274<>\"\",MAX($A383:FV383)+1,\"\")","v":""},{"$f":"IF(FX274<>\"\",MAX($A383:FW383)+1,\"\")","v":""},{"$f":"IF(FY274<>\"\",MAX($A383:FX383)+1,\"\")","v":""},{"$f":"IF(FZ274<>\"\",MAX($A383:FY383)+1,\"\")","v":""},{"$f":"IF(GA274<>\"\",MAX($A383:FZ383)+1,\"\")","v":""},{"$f":"IF(GB274<>\"\",MAX($A383:GA383)+1,\"\")","v":""},{"$f":"IF(GC274<>\"\",MAX($A383:GB383)+1,\"\")","v":""},{"$f":"IF(GD274<>\"\",MAX($A383:GC383)+1,\"\")","v":""},{"$f":"IF(GE274<>\"\",MAX($A383:GD383)+1,\"\")","v":""},{"$f":"IF(GF274<>\"\",MAX($A383:GE383)+1,\"\")","v":""},{"$f":"IF(GG274<>\"\",MAX($A383:GF383)+1,\"\")","v":""},{"$f":"IF(GH274<>\"\",MAX($A383:GG383)+1,\"\")","v":""},{"$f":"IF(GI274<>\"\",MAX($A383:GH383)+1,\"\")","v":""},{"$f":"IF(GJ274<>\"\",MAX($A383:GI383)+1,\"\")","v":""},{"$f":"IF(GK274<>\"\",MAX($A383:GJ383)+1,\"\")","v":""},{"$f":"IF(GL274<>\"\",MAX($A383:GK383)+1,\"\")","v":""},{"$f":"IF(GM274<>\"\",MAX($A383:GL383)+1,\"\")","v":""},{"$f":"IF(GN274<>\"\",MAX($A383:GM383)+1,\"\")","v":""},{"$f":"IF(GO274<>\"\",MAX($A383:GN383)+1,\"\")","v":""},{"$f":"IF(GP274<>\"\",MAX($A383:GO383)+1,\"\")","v":""},{"$f":"IF(GQ274<>\"\",MAX($A383:GP383)+1,\"\")","v":""},{"$f":"IF(GR274<>\"\",MAX($A383:GQ383)+1,\"\")","v":""},{"$f":"IF(GS274<>\"\",MAX($A383:GR383)+1,\"\")","v":""}]

{"sheet":"Empirical","index":9,"n_rows":1001,"n_cols":5,"rows_kept":1001,"cut":false,"hidden":true,"merged":[]}
["Probability","AutoPDDeductibleemp","AutoPDLimitemp","HomeDwellingDeductibleemp","HomeDwellingLimitemp"]
[0.1,1000,8000,20000,200000]
[0.2,1000,8000,20000,200000]
[0.3,1000,8000,20000,200000]
[0.4,1000,8000,20000,200000]
[0.5,1000,8000,20000,200000]
[0.6,1000,8000,20000,200000]
[0.7,1000,8000,20000,200000]
[0.8,1000,8000,20000,200000]
[0.9,1000,8000,20000,200000]
[1,1000,8000,20000,200000]
[1.1000000000000001,1000,8000,20000,200000]
[1.2,1000,8000,20000,200000]
[1.3,1000,8000,20000,200000]
[1.4,1000,8000,20000,200000]
[1.5,1000,8000,20000,200000]
[1.6,1000,8000,20000,200000]
[1.7,1000,8000,20000,200000]
[1.8,1000,8000,20000,200000]
[1.9,1000,8000,20000,200000]
[2,1000,8000,20000,200000]
[2.1,1000,8000,20000,200000]
[2.2000000000000002,1000,8000,20000,200000]
[2.2999999999999998,1000,8000,20000,200000]
[2.4,1000,8000,20000,200000]
[2.5,1000,8000,20000,200000]
[2.6,1000,8000,20000,200000]
[2.7,1000,8000,20000,200000]
[2.8,1000,8000,20000,200000]
[2.9,1000,8000,20000,200000]
[3,1000,8000,20000,200000]
[3.1,1000,8000,20000,200000]
[3.2,1000,8000,20000,200000]
[3.3,1000,8000,20000,200000]
[3.4,1000,8000,20000,200000]
[3.5,1000,8000,20000,200000]
[3.6,1000,8000,20000,200000]
[3.7,1000,8000,20000,200000]
[3.8,1000,8000,20000,200000]
[3.9,1000,8000,20000,200000]
[4,1000,8000,20000,200000]
[4.0999999999999996,1000,8000,20000,200000]
[4.2,1000,8000,20000,200000]
[4.3,1000,8000,20000,200000]
[4.4000000000000004,1000,8000,20000,200000]
[4.5,1000,8000,20000,200000]
[4.5999999999999996,1000,8000,20000,200000]
[4.7,1000,8000,20000,200000]
[4.8,1000,8000,20000,200000]
[4.9000000000000004,1000,8000,20000,200000]
[5,1000,8000,20000,200000]
[5.0999999999999996,1000,8000,20000,200000]
[5.2,1000,8000,20000,200000]
[5.3,1000,8000,20000,200000]
[5.4,1000,8000,20000,200000]
[5.5,1000,8000,20000,200000]
[5.6,1000,8000,20000,200000]
[5.7,1000,8000,20000,200000]
[5.8,1000,8000,20000,200000]
[5.9,1000,8000,20000,200000]
[6,1000,8000,20000,200000]
[6.1,1000,8000,20000,200000]
[6.2,1000,8000,20000,200000]
[6.3,1000,8000,20000,200000]
[6.4,1000,8000,20000,200000]
[6.5,1000,8000,20000,200000]
[6.6,1000,8000,20000,200000]
[6.7,1000,8000,20000,200000]
[6.8,1000,8000,20000,200000]
[6.9,1000,8000,20000,200000]
[7,1000,8000,20000,200000]
[7.1,1000,8000,20000,200000]
[7.2,1000,8000,20000,200000]
[7.3,1000,8000,20000,200000]
[7.4,1000,8000,20000,200000]
[7.5,1000,8000,20000,200000]
[7.6,1000,8000,20000,200000]
[7.7,1000,8000,20000,200000]
[7.8,1000,8000,20000,200000]
[7.9,1000,8000,20000,200000]
[8,1000,8000,20000,200000]
[8.1,1000,8000,20000,200000]
[8.1999999999999993,1000,8000,20000,200000]
[8.3000000000000007,1000,8000,20000,200000]
[8.4,1000,8000,20000,200000]
[8.5,1000,8000,20000,200000]
[8.6,1000,8000,20000,200000]
[8.6999999999999993,1000,8000,20000,200000]
[8.8000000000000007,1000,8000,20000,200000]
[8.9,1000,8000,20000,200000]
[9,1000,8000,20000,200000]
[9.1,1000,8000,20000,200000]
[9.1999999999999993,1000,8000,20000,200000]
[9.3000000000000007,1000,8000,20000,200000]
[9.4,1000,8000,20000,200000]
[9.5,1000,8000,20000,200000]
[9.6,1000,8000,20000,200000]
[9.6999999999999993,1000,8000,20000,200000]
[9.8000000000000007,1000,8000,20000,200000]
[9.9,1000,8000,20000,200000]
[10,1000,8000,20000,200000]
[10.1,1000,8000,20000,200000]
[10.199999999999999,1000,8000,20000,200000]
[10.3,1000,8000,20000,200000]
[10.4,1000,8000,20000,200000]
[10.5,1000,8000,20000,200000]
[10.6,1000,8000,20000,200000]
[10.7,1000,8000,20000,200000]
[10.8,1000,8000,20000,200000]
[10.9,1000,8000,20000,200000]
[11,1000,8000,20000,200000]
[11.1,1000,8000,20000,200000]
[11.2,1000,8000,20000,200000]
[11.3,1000,8000,20000,200000]
[11.4,1000,8000,20000,200000]
[11.5,1000,8000,20000,200000]
[11.6,1000,8000,20000,200000]
[11.7,1000,8000,20000,200000]
[11.8,1000,8000,20000,200000]
[11.9,1000,8000,20000,200000]
[12,1000,8000,20000,200000]
[12.1,1000,8000,20000,200000]
[12.2,1000,8000,20000,200000]
[12.3,1000,8000,20000,200000]
[12.4,1000,8000,20000,200000]
[12.5,1000,8000,20000,200000]
[12.6,1000,8000,20000,200000]
[12.7,1000,8000,20000,200000]
[12.8,1000,8000,20000,200000]
[12.9,1000,8000,20000,200000]
[13,1000,8000,20000,200000]
[13.1,1000,8000,20000,200000]
[13.2,1000,8000,20000,200000]
[13.3,1000,8000,20000,200000]
[13.4,1000,8000,20000,200000]
[13.5,1000,8000,20000,200000]
[13.6,1000,8000,20000,200000]
[13.7,1000,8000,20000,200000]
[13.8,1000,8000,20000,200000]
[13.9,1000,8000,20000,200000]
[14,1000,8000,20000,200000]
[14.1,1000,8000,20000,200000]
[14.2,1000,8000,20000,200000]
[14.3,1000,8000,20000,200000]
[14.4,1000,8000,20000,200000]
[14.5,1000,8000,20000,200000]
[14.6,1000,8000,20000,200000]
[14.7,1000,8000,20000,200000]
[14.8,1000,8000,20000,200000]
[14.9,1000,8000,20000,200000]
[15,1000,8000,20000,200000]
[15.1,1000,8000,20000,200000]
[15.2,1000,8000,20000,200000]
[15.3,1000,8000,20000,200000]
[15.4,1000,8000,20000,200000]
[15.5,1000,8000,20000,200000]
[15.6,1000,8000,20000,200000]
[15.7,1000,8000,20000,200000]
[15.8,1000,8000,20000,200000]
[15.9,1000,8000,20000,200000]
[16,1000,8000,20000,200000]
[16.100000000000001,1000,8000,20000,200000]
[16.2,1000,8000,20000,200000]
[16.3,1000,8000,20000,200000]
[16.399999999999999,1000,8000,20000,200000]
[16.5,1000,8000,20000,200000]
[16.600000000000001,1000,8000,20000,200000]
[16.7,1000,8000,20000,200000]
[16.8,1000,8000,20000,200000]
[16.899999999999999,1000,8000,20000,200000]
[17,1000,8000,20000,200000]
[17.100000000000001,1000,8000,20000,200000]
[17.2,1000,8000,20000,200000]
[17.3,1000,8000,20000,200000]
[17.399999999999999,1000,8000,20000,200000]
[17.5,1000,8000,20000,200000]
[17.600000000000001,1000,8000,20000,200000]
[17.7,1000,8000,20000,200000]
[17.8,1000,8000,20000,200000]
[17.899999999999999,1000,8000,20000,200000]
[18,1000,8000,20000,200000]
[18.100000000000001,1000,8000,20000,200000]
[18.2,1000,8000,20000,200000]
[18.3,1000,8000,20000,200000]
[18.399999999999999,1000,8000,20000,200000]
[18.5,1000,8000,20000,200000]
[18.600000000000001,1000,8000,20000,200000]
[18.7,1000,8000,20000,200000]
[18.8,1000,8000,20000,200000]
[18.899999999999999,1000,8000,20000,200000]
[19,1000,8000,20000,200000]
[19.100000000000001,1000,8000,20000,200000]
[19.2,1000,8000,20000,200000]
[19.3,1000,8000,20000,200000]
[19.399999999999999,1000,8000,20000,200000]
[19.5,1000,8000,20000,200000]
[19.600000000000001,1000,8000,20000,200000]
[19.7,1000,15000,20000,200000]
[19.8,1000,15000,20000,200000]
[19.899999999999999,1000,15000,20000,200000]
[20,1000,15000,20000,200000]
[20.100000000000001,1000,15000,20000,200000]
[20.2,1000,15000,20000,200000]
[20.3,1000,15000,20000,200000]
[20.399999999999999,1000,15000,20000,200000]
[20.5,1000,15000,20000,200000]
[20.6,1000,15000,20000,200000]
[20.7,1000,15000,20000,200000]
[20.8,1000,15000,20000,200000]
[20.9,1000,15000,20000,200000]
[21,1000,15000,20000,200000]
[21.1,1000,15000,20000,200000]
[21.2,1000,15000,20000,200000]
[21.3,1000,15000,20000,200000]
[21.4,1000,15000,20000,200000]
[21.5,1000,15000,20000,200000]
[21.6,1000,15000,20000,200000]
[21.7,1000,15000,20000,200000]
[21.8,1000,15000,20000,200000]
[21.9,1000,15000,20000,200000]
[22,1000,15000,20000,200000]
[22.1,1000,15000,20000,200000]
[22.2,1000,15000,20000,200000]
[22.3,1000,15000,20000,200000]
[22.4,1000,15000,20000,200000]
[22.5,1000,15000,20000,200000]
[22.6,1000,15000,20000,200000]
[22.7,1000,15000,20000,200000]
[22.8,1000,15000,20000,200000]
[22.9,1000,15000,20000,200000]
[23,1000,15000,20000,200000]
[23.1,1000,15000,20000,200000]
[23.2,1000,15000,20000,200000]
[23.3,1000,15000,20000,200000]
[23.4,1000,15000,20000,200000]
[23.5,1000,15000,20000,200000]
[23.6,1000,15000,20000,200000]
[23.7,1000,15000,20000,200000]
[23.8,1000,15000,20000,200000]
[23.9,1000,15000,20000,200000]
[24,1000,15000,20000,200000]
[24.1,1000,15000,20000,200000]
[24.2,1000,15000,20000,200000]
[24.3,1000,15000,20000,200000]
[24.4,1000,15000,20000,200000]
[24.5,1000,15000,20000,200000]
[24.6,1000,15000,20000,200000]
[24.7,1000,15000,20000,200000]
[24.8,1000,15000,20000,200000]
[24.9,1000,15000,20000,200000]
[25,1000,15000,20000,200000]
[25.1,1000,15000,20000,200000]
[25.2,1000,15000,20000,200000]
[25.3,1000,15000,20000,200000]
[25.4,1000,15000,20000,200000]
[25.5,1000,15000,20000,200000]
[25.6,1000,15000,20000,200000]
[25.7,1000,15000,20000,200000]
[25.8,1000,15000,20000,200000]
[25.9,1000,15000,20000,200000]
[26,1000,15000,20000,200000]
[26.1,1000,15000,20000,200000]
[26.2,1000,15000,20000,200000]
[26.3,1000,15000,20000,200000]
[26.4,1000,15000,20000,200000]
[26.5,1000,15000,20000,200000]
[26.6,1000,15000,20000,200000]
[26.7,1000,15000,20000,200000]
[26.8,1000,15000,20000,200000]
[26.9,1000,15000,20000,200000]
[27,1000,15000,20000,200000]
[27.1,1000,15000,20000,200000]
[27.2,1000,15000,20000,200000]
[27.3,1000,15000,20000,200000]
[27.4,1000,15000,20000,200000]
[27.5,1000,15000,20000,200000]
[27.6,1000,15000,20000,200000]
[27.7,1000,15000,20000,200000]
[27.8,1000,15000,20000,200000]
[27.9,1000,15000,20000,200000]
[28,1000,15000,20000,200000]
[28.1,1000,15000,20000,200000]
[28.2,1000,15000,20000,200000]
[28.3,1000,15000,20000,200000]
[28.4,1000,15000,20000,200000]
[28.5,1000,15000,20000,200000]
[28.6,1000,15000,20000,200000]
[28.7,1000,15000,20000,200000]
[28.8,1000,15000,20000,200000]
[28.9,1000,15000,20000,200000]
[29,1000,15000,20000,200000]
[29.1,1000,15000,20000,200000]
[29.2,1000,15000,20000,200000]
[29.3,1000,15000,20000,200000]
[29.4,1000,15000,20000,200000]
[29.5,1000,15000,20000,200000]
[29.6,1000,15000,20000,200000]
[29.7,1000,15000,20000,200000]
[29.8,1000,15000,20000,200000]
[29.9,1000,15000,20000,200000]
[30,1000,15000,20000,200000]
[30.1,1000,15000,20000,200000]
[30.2,1000,15000,20000,200000]
[30.3,1000,15000,20000,200000]
[30.4,1000,15000,20000,200000]
[30.5,1000,15000,20000,200000]
[30.6,1000,15000,20000,200000]
[30.7,1000,15000,20000,200000]
[30.8,1000,15000,20000,200000]
[30.9,1000,15000,20000,200000]
[31,1000,15000,20000,200000]
[31.1,1000,15000,20000,200000]
[31.2,1000,15000,20000,200000]
[31.3,1000,15000,20000,200000]
[31.4,1000,15000,20000,200000]
[31.5,1000,15000,20000,200000]
[31.6,1000,15000,20000,200000]
[31.7,1000,15000,20000,200000]
[31.8,1000,15000,20000,200000]
[31.9,1000,15000,20000,200000]
[32,1000,15000,20000,200000]
[32.1,1000,15000,20000,200000]
[32.200000000000003,1000,15000,20000,200000]
[32.299999999999997,1000,15000,20000,200000]
[32.4,1000,15000,20000,200000]
[32.5,1000,15000,20000,200000]
[32.6,1000,15000,20000,200000]
[32.700000000000003,1000,15000,20000,200000]
[32.799999999999997,1000,15000,20000,200000]
[32.9,1000,15000,20000,200000]
[33,1000,15000,20000,200000]
[33.1,1000,15000,20000,200000]
[33.200000000000003,1000,15000,20000,200000]
[33.299999999999997,1000,15000,20000,200000]
[33.4,1000,15000,20000,200000]
[33.5,1000,15000,20000,200000]
[33.6,1000,15000,20000,200000]
[33.700000000000003,1000,15000,20000,200000]
[33.799999999999997,1000,15000,20000,200000]
[33.9,1000,15000,20000,200000]
[34,1000,15000,20000,200000]
[34.1,1000,15000,20000,200000]
[34.200000000000003,1000,15000,20000,200000]
[34.299999999999997,1000,15000,20000,200000]
[34.4,1000,15000,20000,200000]
[34.5,1000,15000,20000,200000]
[34.6,1000,15000,20000,200000]
[34.700000000000003,1000,15000,20000,200000]
[34.799999999999997,1000,15000,20000,200000]
[34.9,1000,15000,20000,200000]
[35,1000,15000,20000,200000]
[35.1,1000,15000,20000,200000]
[35.200000000000003,1000,15000,20000,200000]
[35.299999999999997,1000,15000,20000,200000]
[35.4,1000,15000,20000,200000]
[35.5,1000,15000,20000,200000]
[35.6,1000,15000,20000,200000]
[35.700000000000003,1000,15000,20000,200000]
[35.799999999999997,1000,15000,20000,200000]
[35.9,1000,15000,20000,200000]
[36,1000,15000,20000,200000]
[36.1,1000,15000,20000,200000]
[36.200000000000003,1000,15000,20000,200000]
[36.299999999999997,1000,15000,20000,200000]
[36.4,1000,15000,20000,200000]
[36.5,1000,15000,20000,200000]
[36.6,1000,15000,20000,200000]
[36.700000000000003,1000,15000,20000,200000]
[36.799999999999997,1000,15000,20000,200000]
[36.9,1000,15000,20000,200000]
[37,1000,15000,20000,200000]
[37.1,1000,15000,20000,200000]
[37.200000000000003,1000,15000,20000,200000]
[37.299999999999997,1000,15000,20000,200000]
[37.4,1000,15000,20000,200000]
[37.5,1000,15000,20000,200000]
[37.6,1000,15000,20000,245600.00000001301]
[37.700000000000003,1000,15000,20000,300000]
[37.799999999999997,1000,15000,20000,300000]
[37.9,1000,15000,20000,300000]
[38,1000,15000,20000,300000]
[38.1,1000,15000,20000,300000]
[38.200000000000003,1000,15000,20000,300000]
[38.299999999999997,1000,15000,20000,300000]
[38.4,1000,15000,20000,300000]
[38.5,1000,15000,20000,300000]
[38.6,1000,15000,20000,300000]
[38.700000000000003,1000,15000,20000,300000]
[38.799999999999997,1000,15000,20000,300000]
[38.9,1000,15000,20000,300000]
[39,1000,15000,20000,300000]
[39.1,1000,15000,20000,300000]
[39.200000000000003,1000,15000,20000,300000]
[39.299999999999997,1000,15000,20000,300000]
[39.4,1000,15000,20000,300000]
[39.5,1000,15000,20000,300000]
[39.6,1000,15000,20000,300000]
[39.700000000000003,1000,15000,20000,300000]
[39.799999999999997,1000,15000,20000,300000]
[39.9,1000,15000,20000,300000]
[40,1000,15000,20000,300000]
[40.1,1000,15000,20000,300000]
[40.200000000000003,1000,15000,20000,300000]
[40.299999999999997,1000,15000,20000,300000]
[40.4,1000,15000,20000,300000]
[40.5,1000,15000,20000,300000]
[40.6,1000,15000,20000,300000]
[40.700000000000003,1000,15000,20000,300000]
[40.799999999999997,1000,15000,20000,300000]
[40.9,1000,15000,20000,300000]
[41,1000,15000,20000,300000]
[41.1,1000,15000,20000,300000]
[41.2,1000,15000,20000,300000]
[41.3,1000,15000,20000,300000]
[41.4,1000,15000,20000,300000]
[41.5,1000,15000,20000,300000]
[41.6,1000,15000,20000,300000]
[41.7,1000,15000,20000,300000]
[41.8,1000,15000,20000,300000]
[41.9,1000,15000,20000,300000]
[42,1000,15000,20000,300000]
[42.1,1000,15000,20000,300000]
[42.2,1000,15000,20000,300000]
[42.3,1000,15000,20000,300000]
[42.4,1000,15000,20000,300000]
[42.5,1000,15000,20000,300000]
[42.6,1000,15000,20000,300000]
[42.7,1000,15000,20000,300000]
[42.8,1000,15000,20000,300000]
[42.9,1000,15000,20000,300000]
[43,1000,15000,20000,300000]
[43.1,1000,15000,20000,300000]
[43.2,1000,15000,20000,300000]
[43.3,1000,15000,20000,300000]
[43.4,1000,15000,20000,300000]
[43.5,1000,15000,20000,300000]
[43.6,1000,15000,20000,300000]
[43.7,1000,15000,20000,300000]
[43.8,1000,15000,20000,300000]
[43.9,1000,15000,20000,300000]
[44,1000,15000,20000,300000]
[44.1,1000,15000,20000,300000]
[44.2,1000,15000,20000,300000]
[44.3,1000,15000,20000,300000]
[44.4,1000,15000,20000,300000]
[44.5,1000,15000,20000,300000]
[44.6,1000,15000,20000,300000]
[44.7,1000,15000,20000,300000]
[44.8,1000,15000,20000,300000]
[44.9,1000,15000,20000,300000]
[45,1000,15000,20000,300000]
[45.1,1000,15000,20000,300000]
[45.2,1000,15000,20000,300000]
[45.3,1000,15000,20000,300000]
[45.4,1000,15000,20000,300000]
[45.5,1000,15000,20000,300000]
[45.6,1000,15000,20000,300000]
[45.7,1000,15000,20000,300000]
[45.8,1000,15000,20000,300000]
[45.9,1000,15000,20000,300000]
[46,1000,15000,20000,300000]
[46.1,1000,15000,20000,300000]
[46.2,1000,15000,20000,300000]
[46.3,1000,15000,20000,300000]
[46.4,1000,15000,20000,300000]
[46.5,1000,15000,20000,300000]
[46.6,1000,15000,20000,300000]
[46.7,1000,15000,20000,300000]
[46.8,1000,15000,20000,300000]
[46.9,1000,15000,20000,300000]
[47,1000,15000,20000,300000]
[47.1,1000,15000,20000,300000]
[47.2,1000,15000,20000,300000]
[47.3,1000,15000,20000,300000]
[47.4,1000,15000,20000,300000]
[47.5,1000,15000,20000,300000]
[47.6,1000,15000,20000,300000]
[47.7,1000,15000,20000,300000]
[47.8,1000,15000,20000,300000]
[47.9,1000,15000,20000,300000]
[48,1000,15000,20000,300000]
[48.1,1000,15000,20000,300000]
[48.2,1000,15000,20000,300000]
[48.3,1000,15000,20000,300000]
[48.4,1000,15000,20000,300000]
[48.5,1000,15000,20000,300000]
[48.6,1000,15000,20000,300000]
[48.7,1000,15000,20000,300000]
[48.8,1000,15000,20000,300000]
[48.9,1000,15000,20000,300000]
[49,1000,15000,20000,300000]
[49.1,1000,15000,20000,300000]
[49.2,1000,15000,20000,300000]
[49.3,1000,15000,20000,300000]
[49.4,1000,15000,20000,300000]
[49.5,1000,15000,20000,300000]
[49.6,1000,15000,20000,300000]
[49.7,1000,15000,20000,300000]
[49.8,1000,20000,20000,300000]
[49.9,1000,20000,20000,300000]
[50,1000,20000,20000,300000]
[50.1,1000,20000,20000,300000]
[50.2,1000,20000,20000,300000]
[50.3,1000,20000,20000,300000]
[50.4,1000,20000,20000,300000]
[50.5,1000,20000,20000,300000]
[50.6,1000,20000,20000,300000]
[50.7,1000,20000,20000,300000]
[50.8,1000,20000,20000,300000]
[50.9,1000,20000,20000,300000]
[51,1000,20000,20000,300000]
[51.1,1000,20000,20000,300000]
[51.2,1000,20000,20000,300000]
[51.3,1000,20000,20000,300000]
[51.4,1000,20000,20000,300000]
[51.5,1000,20000,20000,300000]
[51.6,1000,20000,20000,300000]
[51.7,1000,20000,20000,300000]
[51.8,1000,20000,20000,300000]
[51.9,1000,20000,20000,300000]
[52,1000,20000,20000,300000]
[52.1,1000,20000,20000,300000]
[52.2,1000,20000,20000,300000]
[52.3,1000,20000,20000,300000]
[52.4,1000,20000,20000,300000]
[52.5,1000,20000,20000,300000]
[52.6,1000,20000,20000,300000]
[52.7,1000,20000,20000,300000]
[52.8,1000,20000,20000,300000]
[52.9,1000,20000,20000,300000]
[53,1000,20000,20000,300000]
[53.1,1000,20000,20000,300000]
[53.2,1000,20000,20000,300000]
[53.3,1000,20000,20000,300000]
[53.4,1000,20000,20000,300000]
[53.5,1000,20000,20000,300000]
[53.6,1000,20000,20000,300000]
[53.7,1000,20000,20000,300000]
[53.8,1000,20000,20000,300000]
[53.9,1000,20000,20000,300000]
[54,1000,20000,20000,300000]
[54.1,1000,20000,20000,300000]
[54.2,1000,20000,20000,300000]
[54.3,1000,20000,20000,300000]
[54.4,1000,20000,20000,300000]
[54.5,1000,20000,20000,300000]
[54.6,1000,20000,20000,300000]
[54.7,1000,20000,20000,300000]
[54.8,1000,20000,20000,300000]
[54.9,1000,20000,20000,300000]
[55,1000,20000,20000,300000]
[55.1,1000,20000,20000,300000]
[55.2,1000,20000,20000,300000]
[55.3,1000,20000,20000,300000]
[55.4,1000,20000,20000,300000]
[55.5,1000,20000,20000,300000]
[55.6,1000,20000,20000,300000]
[55.7,1000,20000,20000,300000]
[55.8,1000,20000,20000,300000]
[55.9,1000,20000,20000,300000]
[56,1000,20000,20000,300000]
[56.1,1000,20000,20000,300000]
[56.2,1000,20000,20000,300000]
[56.3,1000,20000,20000,300000]
[56.4,1000,20000,20000,300000]
[56.5,1000,20000,20000,300000]
[56.6,1000,20000,20000,300000]
[56.7,1000,20000,20000,300000]
[56.8,1000,20000,20000,300000]
[56.9,1000,20000,20000,300000]
[57,1000,20000,20000,300000]
[57.1,1000,20000,20000,300000]
[57.2,1000,20000,20000,300000]
[57.3,1000,20000,20000,300000]
[57.4,1000,20000,20000,300000]
[57.5,1000,20000,20000,300000]
[57.6,1000,20000,20000,300000]
[57.7,1000,20000,20000,300000]
[57.8,1000,20000,20000,300000]
[57.9,1000,20000,20000,300000]
[58,1000,20000,20000,300000]
[58.1,1000,20000,20000,300000]
[58.2,1000,20000,20000,300000]
[58.3,1000,20000,20000,300000]
[58.4,1000,20000,20000,300000]
[58.5,1000,20000,20000,300000]
[58.6,1000,20000,20000,300000]
[58.7,1000,20000,20000,300000]
[58.8,1000,20000,20000,300000]
[58.9,1000,20000,20000,300000]
[59,1000,20000,20000,300000]
[59.1,1000,20000,20000,300000]
[59.2,1000,20000,20000,300000]
[59.3,1000,20000,20000,300000]
[59.4,1000,20000,20000,300000]
[59.5,1000,20000,20000,300000]
[59.6,1000,20000,20000,300000]
[59.7,1000,20000,20000,300000]
[59.8,1000,20000,20000,300000]
[59.9,1000,20000,20000,300000]
[60,1000,20000,20000,300000]
[60.1,1000,20000,20000,300000]
[60.2,1000,20000,20000,300000]
[60.3,1000,20000,20000,300000]
[60.4,1000,20000,20000,300000]
[60.5,1000,20000,20000,300000]
[60.6,1000,20000,20000,300000]
[60.7,1000,20000,20000,300000]
[60.8,1000,20000,20000,300000]
[60.9,1000,20000,20000,300000]
[61,1000,20000,20000,300000]
[61.1,1000,20000,20000,300000]
[61.2,1000,20000,20000,300000]
[61.3,1000,20000,20000,300000]
[61.4,1000,20000,20000,300000]
[61.5,1000,20000,20000,300000]
[61.6,1000,20000,20000,300000]
[61.7,1000,20000,20000,300000]
[61.8,1000,20000,20000,300000]
[61.9,1000,20000,20000,300000]
[62,1000,20000,20000,300000]
[62.1,1000,20000,20000,300000]
[62.2,1000,20000,20000,300000]
[62.3,1000,20000,20000,300000]
[62.4,1000,20000,20000,300000]
[62.5,1000,20000,20000,300000]
[62.6,1000,20000,20000,300000]
[62.7,1000,20000,20000,300000]
[62.8,1000,20000,20000,300000]
[62.9,1000,20000,20000,300000]
[63,1000,20000,20000,300000]
[63.1,1000,20000,20000,300000]
[63.2,1000,20000,20000,300000]
[63.3,1000,20000,20000,300000]
[63.4,1000,20000,20000,300000]
[63.5,1000,20000,20000,300000]
[63.6,1000,20000,20000,300000]
[63.7,1000,20000,20000,300000]
[63.8,1000,20000,20000,300000]
[63.9,1000,20000,20000,300000]
[64,1000,20000,20000,300000]
[64.099999999999994,1000,20000,20000,300000]
[64.2,1000,20000,20000,300000]
[64.3,1000,20000,20000,300000]
[64.400000000000006,1000,20000,20000,300000]
[64.5,1000,20000,20000,300000]
[64.599999999999994,1000,20000,20000,300000]
[64.7,1000,20000,20000,300000]
[64.8,1000,20000,20000,300000]
[64.900000000000006,1000,20000,20000,300000]
[65,1000,20000,20000,300000]
[65.099999999999994,1000,20000,20000,300000]
[65.2,1000,20000,20000,300000]
[65.3,1000,20000,20000,300000]
[65.400000000000006,1000,20000,20000,300000]
[65.5,1000,20000,20000,300000]
[65.599999999999994,1000,20000,20000,300000]
[65.7,1000,20000,20000,300000]
[65.8,1000,20000,20000,300000]
[65.900000000000006,1000,20000,20000,300000]
[66,1000,20000,20000,300000]
[66.099999999999994,1000,20000,20000,300000]
[66.2,1000,20000,20000,300000]
[66.3,1000,20000,20000,300000]
[66.400000000000006,1000,20000,20000,300000]
[66.5,1000,20000,20000,300000]
[66.599999999999994,1000,20000,20000,300000]
[66.7,1000,20000,20000,300000]
[66.8,1000,20000,20000,300000]
[66.900000000000006,1000,20000,20000,300000]
[67,1000,20000,20000,300000]
[67.099999999999994,1000,20000,20000,300000]
[67.2,1000,20000,20000,300000]
[67.3,1000,20000,20000,300000]
[67.400000000000006,1000,20000,20000,300000]
[67.5,1000,20000,20000,300000]
[67.599999999999994,1000,20000,20000,300000]
[67.7,1000,20000,20000,300000]
[67.8,1000,20000,20000,300000]
[67.900000000000006,1000,20000,20000,300000]
[68,1000,20000,20000,300000]
[68.099999999999994,1000,20000,20000,300000]
[68.2,1000,20000,20000,300000]
[68.3,1000,20000,20000,300000]
[68.400000000000006,1000,20000,20000,300000]
[68.5,1000,20000,20000,300000]
[68.599999999999994,1000,20000,20000,300000]
[68.7,1000,20000,20000,300000]
[68.8,1000,20000,20000,300000]
[68.900000000000006,1000,20000,20000,300000]
[69,1000,20000,20000,300000]
[69.099999999999994,1000,20000,20000,300000]
[69.2,1000,20000,20000,300000]
[69.3,1000,20000,20000,300000]
[69.400000000000006,1000,20000,20000,300000]
[69.5,1000,20000,20000,300000]
[69.599999999999994,1000,20000,20000,300000]
[69.7,1000,20000,20000,300000]
[69.8,1000,20000,20000,300000]
[69.900000000000006,1000,20000,20000,300000]
[70,1000,20000,20000,300000]
[70.099999999999994,1000,20000,20000,300000]
[70.2,1000,20000,20000,300000]
[70.3,1000,20000,20000,300000]
[70.400000000000006,1000,20000,20000,300000]
[70.5,1000,20000,20000,300000]
[70.599999999999994,1000,20000,20000,300000]
[70.7,1000,20000,20000,300000]
[70.8,1000,20000,20000,300000]
[70.900000000000006,1000,20000,20000,300000]
[71,1000,20000,20000,300000]
[71.099999999999994,1000,20000,20000,300000]
[71.2,1000,20000,20000,300000]
[71.3,1000,20000,20000,300000]
[71.400000000000006,1000,20000,20000,300000]
[71.5,1000,20000,20000,300000]
[71.599999999999994,1000,20000,20000,300000]
[71.7,1000,20000,20000,300000]
[71.8,1000,20000,20000,300000]
[71.900000000000006,1000,20000,20000,300000]
[72,1000,20000,20000,300000]
[72.099999999999994,1000,20000,20000,300000]
[72.2,1000,20000,20000,300000]
[72.3,1000,20000,20000,300000]
[72.400000000000006,1000,20000,20000,300000]
[72.5,1000,20000,20000,300000]
[72.599999999999994,1000,20000,20000,300000]
[72.7,1000,20000,20000,300000]
[72.8,1000,20000,20000,300000]
[72.900000000000006,1000,20000,20000,300000]
[73,1000,20000,20000,300000]
[73.099999999999994,1000,20000,20000,300000]
[73.2,1000,20000,20000,300000]
[73.3,1000,20000,20000,300000]
[73.400000000000006,1000,20000,20000,300000]
[73.5,1000,20000,20000,300000]
[73.599999999999994,1000,20000,20000,300000]
[73.7,1000,20000,20000,300000]
[73.8,1000,20000,20000,300000]
[73.900000000000006,1000,20000,20000,300000]
[74,1000,20000,20000,300000]
[74.099999999999994,1000,20000,20000,300000]
[74.2,1000,20000,20000,300000]
[74.3,1000,20000,20000,300000]
[74.400000000000006,1000,20000,20000,300000]
[74.5,1000,20000,20000,300000]
[74.599999999999994,1000,20000,20000,300000]
[74.7,1000,20000,20000,300000]
[74.8,1000,20000,20000,300000]
[74.900000000000006,1000,20000,20000,300000]
[75,1000,20000,20000,300000]
[75.099999999999994,1000,20000,20000,300000]
[75.2,1000,20000,20000,300000]
[75.3,1000,20000,20000,300000]
[75.400000000000006,1000,20000,20000,300000]
[75.5,1000,20000,20000,300000]
[75.599999999999994,1000,20000,20000,300000]
[75.7,1000,20000,20000,300000]
[75.8,1000,20000,20000,300000]
[75.900000000000006,1000,20000,20000,300000]
[76,1000,20000,20000,300000]
[76.099999999999994,1000,20000,20000,300000]
[76.2,1000,20000,20000,300000]
[76.3,1000,20000,20000,300000]
[76.400000000000006,1000,20000,20000,300000]
[76.5,1000,20000,20000,300000]
[76.599999999999994,1000,20000,20000,300000]
[76.7,1000,20000,20000,300000]
[76.8,1000,20000,20000,300000]
[76.900000000000006,1000,20000,20000,300000]
[77,1000,20000,20000,300000]
[77.099999999999994,1000,20000,20000,300000]
[77.2,1000,20000,20000,300000]
[77.3,1000,20000,20000,300000]
[77.400000000000006,1000,20000,20000,300000]
[77.5,1000,20000,20000,300000]
[77.599999999999994,1000,20000,20000,300000]
[77.7,1000,20000,20000,300000]
[77.8,1000,20000,20000,300000]
[77.900000000000006,1000,20000,20000,300000]
[78,1000,20000,20000,300000]
[78.099999999999994,1000,20000,20000,300000]
[78.2,1000,20000,20000,300000]
[78.3,1000,20000,20000,300000]
[78.400000000000006,1000,20000,20000,300000]
[78.5,1000,20000,20000,300000]
[78.599999999999994,1000,20000,20000,300000]
[78.7,1000,20000,20000,300000]
[78.8,1000,20000,20000,300000]
[78.900000000000006,1000,20000,20000,300000]
[79,1000,20000,20000,300000]
[79.099999999999994,1000,20000,20000,300000]
[79.2,1000,20000,20000,300000]
[79.3,1000,20000,20000,300000]
[79.400000000000006,1000,20000,20000,300000]
[79.5,1000,20000,20000,300000]
[79.599999999999994,1000,20000,20000,300000]
[79.7,1000,20000,20000,300000]
[79.8,1000,20000,20000,300000]
[79.900000000000006,1000,20000,20000,300000]
[80,1000,20000,20000,300000]
[80.099999999999994,1000,20000,20000,300000]
[80.2,1000,20000,20000,300000]
[80.3,1000,20000,20000,300000]
[80.400000000000006,1000,20000,20000,300000]
[80.5,1000,20000,20000,300000]
[80.599999999999994,1000,20000,20000,300000]
[80.7,1000,20000,20000,300000]
[80.8,1000,20000,20000,300000]
[80.900000000000006,1000,20000,20000,300000]
[81,1000,20000,20000,300000]
[81.099999999999994,1000,20000,20000,300000]
[81.2,1000,20000,20000,300000]
[81.3,1000,20000,20000,300000]
[81.400000000000006,1000,20000,20000,300000]
[81.5,1000,20000,20000,300000]
[81.599999999999994,1000,20000,20000,300000]
[81.7,1000,20000,20000,300000]
[81.8,1000,20000,20000,300000]
[81.900000000000006,1000,20000,20000,300000]
[82,1000,20000,20000,300000]
[82.1,1000,20000,20000,300000]
[82.2,1000,20000,20000,300000]
[82.3,1000,20000,20000,300000]
[82.4,1000,20000,20000,300000]
[82.5,1000,20000,20000,300000]
[82.6,1000,20000,20000,300000]
[82.7,1000,20000,20000,300000]
[82.8,1000,20000,20000,300000]
[82.9,1000,20000,20000,300000]
[83,1000,20000,20000,300000]
[83.1,1000,20000,20000,300000]
[83.2,1000,20000,20000,300000]
[83.3,1000,20000,20000,300000]
[83.4,1000,20000,20000,300000]
[83.5,1000,20000,20000,300000]
[83.6,1000,20000,20000,300000]
[83.7,1000,20000,20000,300000]
[83.8,1000,20000,20000,300000]
[83.9,1000,20000,20000,300000]
[84,1000,20000,20000,300000]
[84.1,1000,20000,20000,300000]
[84.2,1000,20000,20000,300000]
[84.3,1000,20000,20000,300000]
[84.4,1000,20000,20000,300000]
[84.5,1000,20000,20000,300000]
[84.6,1000,20000,20000,300000]
[84.7,1000,20000,20000,300000]
[84.8,1000,20000,20000,300000]
[84.9,1000,20000,20000,300000]
[85,1000,20000,20000,300000]
[85.1,1000,20000,20000,300000]
[85.2,1000,20000,20000,300000]
[85.3,1000,20000,20000,300000]
[85.4,1000,20000,20000,300000]
[85.5,1000,20000,20000,300000]
[85.6,1000,20000,20000,300000]
[85.7,1000,20000,20000,300000]
[85.8,1000,20000,20000,300000]
[85.9,1000,20000,20000,300000]
[86,1000,20000,20000,300000]
[86.1,1000,20000,20000,300000]
[86.2,1000,20000,20000,300000]
[86.3,1000,20000,20000,300000]
[86.4,1000,20000,20000,300000]
[86.5,1000,20000,20000,300000]
[86.6,1000,20000,20000,300000]
[86.7,1000,20000,20000,300000]
[86.8,1000,20000,20000,300000]
[86.9,1000,20000,20000,300000]
[87,1000,20000,20000,300000]
[87.1,1000,20000,20000,300000]
[87.2,1000,20000,20000,300000]
[87.3,1000,20000,20000,300000]
[87.4,1000,20000,20000,300000]
[87.5,1000,20000,20000,300000]
[87.6,1000,20000,20000,300000]
[87.7,1000,20000,20000,300000]
[87.8,1000,20000,20000,300000]
[87.9,1000,20000,20000,300000]
[88,1000,20000,20000,300000]
[88.1,1000,20000,20000,300000]
[88.2,1000,20000,20000,300000]
[88.3,1000,20000,20000,300000]
[88.4,1000,20000,20000,300000]
[88.5,1000,20000,20000,300000]
[88.6,1000,20000,20000,300000]
[88.7,1000,20000,20000,300000]
[88.8,1000,20000,20000,300000]
[88.9,1000,20000,20000,300000]
[89,1000,20000,20000,300000]
[89.1,1000,20000,20000,300000]
[89.2,1000,20000,20000,300000]
[89.3,1000,20000,20000,300000]
[89.4,1000,20000,20000,300000]
[89.5,1000,20000,20000,300000]
[89.6,1000,20000,20000,300000]
[89.7,1000,20000,20000,300000]
[89.8,1000,20000,20000,300000]
[89.9,1000,20000,20000,300000]
[90,1000,20000,20000,300000]
[90.1,1000,20000,20000,300000]
[90.2,1000,20000,20000,300000]
[90.3,1000,20000,20000,300000]
[90.4,1000,20000,20000,300000]
[90.5,1000,20000,20000,300000]
[90.6,1000,20000,20000,300000]
[90.7,1000,20000,20000,300000]
[90.8,1000,20000,20000,300000]
[90.9,1000,20000,20000,300000]
[91,1000,20000,20000,300000]
[91.1,1000,20000,20000,300000]
[91.2,1000,20000,20000,300000]
[91.3,1000,20000,20000,300000]
[91.4,1000,20000,20000,300000]
[91.5,1000,20000,20000,300000]
[91.6,1000,20000,20000,300000]
[91.7,1000,20000,20000,300000]
[91.8,1000,20000,20000,300000]
[91.9,1000,20000,20000,300000]
[92,1000,20000,20000,300000]
[92.1,1000,20000,20000,300000]
[92.2,1000,20000,20000,300000]
[92.3,1000,20000,20000,300000]
[92.4,1000,20000,20000,300000]
[92.5,1000,20000,20000,300000]
[92.6,1000,20000,20000,300000]
[92.7,1000,20000,20000,300000]
[92.8,1000,20000,20000,300000]
[92.9,1000,20000,20000,300000]
[93,1000,20000,20000,300000]
[93.1,1000,20000,20000,300000]
[93.2,1000,20000,20000,300000]
[93.3,1000,20000,20000,300000]
[93.4,1000,20000,20000,300000]
[93.5,1000,20000,20000,300000]
[93.6,1000,20000,20000,300000]
[93.7,1000,20000,20000,300000]
[93.8,1000,20000,20000,300000]
[93.9,1000,20000,20000,300000]
[94,1000,20000,20000,300000]
[94.1,1000,20000,20000,300000]
[94.2,1000,20000,20000,300000]
[94.3,1000,20000,20000,300000]
[94.4,1000,20000,20000,300000]
[94.5,1000,20000,20000,300000]
[94.6,1000,20000,20000,300000]
[94.7,1000,20000,20000,300000]
[94.8,1000,20000,20000,300000]
[94.9,1000,20000,20000,300000]
[95,1000,20000,20000,300000]
[95.1,1000,20000,20000,300000]
[95.2,1000,20000,20000,300000]
[95.3,1000,20000,20000,300000]
[95.4,1000,20000,20000,300000]
[95.5,1000,20000,20000,300000]
[95.6,1000,20000,20000,300000]
[95.7,1000,20000,20000,300000]
[95.8,1000,20000,20000,300000]
[95.9,1000,20000,20000,300000]
[96,1000,20000,20000,300000]
[96.1,1000,20000,20000,300000]
[96.2,1000,20000,20000,300000]
[96.3,1000,20000,20000,300000]
[96.4,1000,20000,20000,300000]
[96.5,1000,20000,20000,300000]
[96.6,1000,20000,20000,300000]
[96.7,1000,20000,20000,300000]
[96.8,1000,20000,20000,300000]
[96.9,1000,20000,20000,300000]
[97,1000,20000,20000,300000]
[97.1,1000,20000,20000,300000]
[97.2,1000,20000,20000,300000]
[97.3,1000,20000,20000,300000]
[97.4,1000,20000,20000,300000]
[97.5,1000,20000,20000,300000]
[97.6,1000,20000,20000,300000]
[97.7,1000,20000,20000,300000]
[97.8,1000,20000,20000,300000]
[97.9,1000,20000,20000,300000]
[98,1000,20000,20000,300000]
[98.1,1000,20000,20000,300000]
[98.2,1000,20000,20000,300000]
[98.3,1000,20000,20000,300000]
[98.4,1000,20000,20000,300000]
[98.5,1000,20000,20000,300000]
[98.6,1000,20000,20000,300000]
[98.7,1000,20000,20000,300000]
[98.8,1000,20000,20000,300000]
[98.9,1000,20000,20000,300000]
[99,1000,20000,20000,300000]
[99.1,1000,20000,20000,300000]
[99.2,1000,20000,20000,300000]
[99.3,1000,20000,20000,300000]
[99.4,1000,20000,20000,300000]
[99.5,1000,20000,20000,300000]
[99.6,1000,20000,20000,300000]
[99.7,1000,20000,20000,300000]
[99.8,1000,20000,20000,300000]
[99.9,1000,20000,20000,300000]
[100,1000,20000,20000,300000]

{"sheet":"List","index":10,"n_rows":101,"n_cols":13,"rows_kept":101,"cut":false,"hidden":true,"merged":[]}
["Distribution","Para1 Min","Para1 Max","Para2 Min","Para2 Max","Copula","Required Claim Data Field","LoB","Claim Type","Factor&Function","Function","Index","FactorTable"]
["Normal",null,null,0,null,"normal","ClaimID","Home","Dwelling","CondPaid",{"$f":"IF(ISERROR(INDEX(funList,MATCH(ROW()-ROW($K$1),Function!$C$110:$CX$110,0))),\"\",INDEX(funList,MATCH(ROW()-ROW($K$1),Function!$C$110:$CX$110,0)))","v":"ZeroFunc"},{"$f":"IF(ISERROR(INDEX(indexList,MATCH(ROW()-ROW($L$1),Index!$B$383:$CW$383,0))),\"\",INDEX(indexList,MATCH(ROW()-ROW($L$1),Index!$B$383:$CW$383,0)))","v":"Flat"},{"$f":"IF(ISERROR(INDEX(tabList,MATCH(ROW()-ROW($M$1)+MAX(Function!$C$110:$CX$110),FactorTable!$B$111:$GS$111,0))),\"\",INDEX(tabList,MATCH(ROW()-ROW($M$1)+MAX(Function!$C$110:$CX$110),FactorTable!$B$111:$GS$111,0)))","v":"ZeroTable"}]
["Beta",0,null,0,null,"t","LoB","Auto","PD","CondIncurLoss",{"$f":"IF(ISERROR(INDEX(funList,MATCH(ROW()-ROW($K$1),Function!$C$110:$CX$110,0))),\"\",INDEX(funList,MATCH(ROW()-ROW($K$1),Function!$C$110:$CX$110,0)))","v":"F1"},{"$f":"IF(ISERROR(INDEX(indexList,MATCH(ROW()-ROW($L$1),Index!$B$383:$CW$383,0))),\"\",INDEX(indexList,MATCH(ROW()-ROW($L$1),Index!$B$383:$CW$383,0)))","v":"I2"},{"$f":"IF(ISERROR(INDEX(tabList,MATCH(ROW()-ROW($M$1)+MAX(Function!$C$110:$CX$110),FactorTable!$B$111:$GS$111,0))),\"\",INDEX(tabList,MATCH(ROW()-ROW($M$1)+MAX(Function!$C$110:$CX$110),FactorTable!$B$111:$GS$111,0)))","v":"Level"}]
["Exponential",0,null,null,null,"clayton","Type",null,null,{"$f":"IF(ISERROR(INDEX(funList,MATCH(ROW()-2-ROW($J$1),Function!$C$110:$CX$110,0))),IF(ISERROR(INDEX(tabList,MATCH(ROW()-2-ROW($J$1),FactorTable!$B$111:$GS$111,0))),\"\",INDEX(tabList,MATCH(ROW()-2-ROW($J$1),FactorTable!$B$111:$GS$111,0))),INDEX(funList,MATCH(ROW()-2-ROW($J$1),Function!$C$110:$CX$110,0)))","v":"ZeroFunc"},{"$f":"IF(ISERROR(INDEX(funList,MATCH(ROW()-ROW($K$1),Function!$C$110:$CX$110,0))),\"\",INDEX(funList,MATCH(ROW()-ROW($K$1),Function!$C$110:$CX$110,0)))","v":"F2"},{"$f":"IF(ISERROR(INDEX(indexList,MATCH(ROW()-ROW($L$1),Index!$B$383:$CW$383,0))),\"\",INDEX(indexList,MATCH(ROW()-ROW($L$1),Index!$B$383:$CW$383,0)))","v":"I3"},{"$f":"IF(ISERROR(INDEX(tabList,MATCH(ROW()-ROW($M$1)+MAX(Function!$C$110:$CX$110),FactorTable!$B$111:$GS$111,0))),\"\",INDEX(tabList,MATCH(ROW()-ROW($M$1)+MAX(Function!$C$110:$CX$110),FactorTable!$B$111:$GS$111,0)))","v":"D1"}]
["Gamma",0,null,0,null,"frank","status",null,null,{"$f":"IF(ISERROR(INDEX(funList,MATCH(ROW()-2-ROW($J$1),Function!$C$110:$CX$110,0))),IF(ISERROR(INDEX(tabList,MATCH(ROW()-2-ROW($J$1),FactorTable!$B$111:$GS$111,0))),\"\",INDEX(tabList,MATCH(ROW()-2-ROW($J$1),FactorTable!$B$111:$GS$111,0))),INDEX(funList,MATCH(ROW()-2-ROW($J$1),Function!$C$110:$CX$110,0)))","v":"F1"},{"$f":"IF(ISERROR(INDEX(funList,MATCH(ROW()-ROW($K$1),Function!$C$110:$CX$110,0))),\"\",INDEX(funList,MATCH(ROW()-ROW($K$1),Function!$C$110:$CX$110,0)))","v":"F3"},{"$f":"IF(ISERROR(INDEX(indexList,MATCH(ROW()-ROW($L$1),Index!$B$383:$CW$383,0))),\"\",INDEX(indexList,MATCH(ROW()-ROW($L$1),Index!$B$383:$CW$383,0)))","v":""},{"$f":"IF(ISERROR(INDEX(tabList,MATCH(ROW()-ROW($M$1)+MAX(Function!$C$110:$CX$110),FactorTable!$B$111:$GS$111,0))),\"\",INDEX(tabList,MATCH(ROW()-ROW($M$1)+MAX(Function!$C$110:$CX$110),FactorTable!$B$111:$GS$111,0)))","v":"D2"}]
["Geometric",0,1,null,null,"gumbel","occurrenceDate",null,null,{"$f":"IF(ISERROR(INDEX(funList,MATCH(ROW()-2-ROW($J$1),Function!$C$110:$CX$110,0))),IF(ISERROR(INDEX(tabList,MATCH(ROW()-2-ROW($J$1),FactorTable!$B$111:$GS$111,0))),\"\",INDEX(tabList,MATCH(ROW()-2-ROW($J$1),FactorTable!$B$111:$GS$111,0))),INDEX(funList,MATCH(ROW()-2-ROW($J$1),Function!$C$110:$CX$110,0)))","v":"F2"},{"$f":"IF(ISERROR(INDEX(funList,MATCH(ROW()-ROW($K$1),Function!$C$110:$CX$110,0))),\"\",INDEX(funList,MATCH(ROW()-ROW($K$1),Function!$C$110:$CX$110,0)))","v":""},{"$f":"IF(ISERROR(INDEX(indexList,MATCH(ROW()-ROW($L$1),Index!$B$383:$CW$383,0))),\"\",INDEX(indexList,MATCH(ROW()-ROW($L$1),Index!$B$383:$CW$383,0)))","v":""},{"$f":"IF(ISERROR(INDEX(tabList,MATCH(ROW()-ROW($M$1)+MAX(Function!$C$110:$CX$110),FactorTable!$B$111:$GS$111,0))),\"\",INDEX(tabList,MATCH(ROW()-ROW($M$1)+MAX(Function!$C$110:$CX$110),FactorTable!$B$111:$GS$111,0)))","v":"D3"}]
["Lognormal",null,null,0,null,"joe","reportDate",null,null,{"$f":"IF(ISERROR(INDEX(funList,MATCH(ROW()-2-ROW($J$1),Function!$C$110:$CX$110,0))),IF(ISERROR(INDEX(tabList,MATCH(ROW()-2-ROW($J$1),FactorTable!$B$111:$GS$111,0))),\"\",INDEX(tabList,MATCH(ROW()-2-ROW($J$1),FactorTable!$B$111:$GS$111,0))),INDEX(funList,MATCH(ROW()-2-ROW($J$1),Function!$C$110:$CX$110,0)))","v":"F3"},{"$f":"IF(ISERROR(INDEX(funList,MATCH(ROW()-ROW($K$1),Function!$C$110:$CX$110,0))),\"\",INDEX(funList,MATCH(ROW()-ROW($K$1),Function!$C$110:$CX$110,0)))","v":""},{"$f":"IF(ISERROR(INDEX(indexList,MATCH(ROW()-ROW($L$1),Index!$B$383:$CW$383,0))),\"\",INDEX(indexList,MATCH(ROW()-ROW($L$1),Index!$B$383:$CW$383,0)))","v":""},{"$f":"IF(ISERROR(INDEX(tabList,MATCH(ROW()-ROW($M$1)+MAX(Function!$C$110:$CX$110),FactorTable!$B$111:$GS$111,0))),\"\",INDEX(tabList,MATCH(ROW()-ROW($M$1)+MAX(Function!$C$110:$CX$110),FactorTable!$B$111:$GS$111,0)))","v":"AutoPDp0"}]
["NegativeBinomial",0,null,0,1,"Independent","incurredLoss",null,null,{"$f":"IF(ISERROR(INDEX(funList,MATCH(ROW()-2-ROW($J$1),Function!$C$110:$CX$110,0))),IF(ISERROR(INDEX(tabList,MATCH(ROW()-2-ROW($J$1),FactorTable!$B$111:$GS$111,0))),\"\",INDEX(tabList,MATCH(ROW()-2-ROW($J$1),FactorTable!$B$111:$GS$111,0))),INDEX(funList,MATCH(ROW()-2-ROW($J$1),Function!$C$110:$CX$110,0)))","v":"ZeroTable"},{"$f":"IF(ISERROR(INDEX(funList,MATCH(ROW()-ROW($K$1),Function!$C$110:$CX$110,0))),\"\",INDEX(funList,MATCH(ROW()-ROW($K$1),Function!$C$110:$CX$110,0)))","v":""},{"$f":"IF(ISERROR(INDEX(indexList,MATCH(ROW()-ROW($L$1),Index!$B$383:$CW$383,0))),\"\",INDEX(indexList,MATCH(ROW()-ROW($L$1),Index!$B$383:$CW$383,0)))","v":""},{"$f":"IF(ISERROR(INDEX(tabList,MATCH(ROW()-ROW($M$1)+MAX(Function!$C$110:$CX$110),FactorTable!$B$111:$GS$111,0))),\"\",INDEX(tabList,MATCH(ROW()-ROW($M$1)+MAX(Function!$C$110:$CX$110),FactorTable!$B$111:$GS$111,0)))","v":"HomeDwellingp0"}]
["Pareto",0,null,0,null,null,"settlementDate",null,null,{"$f":"IF(ISERROR(INDEX(funList,MATCH(ROW()-2-ROW($J$1),Function!$C$110:$CX$110,0))),IF(ISERROR(INDEX(tabList,MATCH(ROW()-2-ROW($J$1),FactorTable!$B$111:$GS$111,0))),\"\",INDEX(tabList,MATCH(ROW()-2-ROW($J$1),FactorTable!$B$111:$GS$111,0))),INDEX(funList,MATCH(ROW()-2-ROW($J$1),Function!$C$110:$CX$110,0)))","v":"Level"},{"$f":"IF(ISERROR(INDEX(funList,MATCH(ROW()-ROW($K$1),Function!$C$110:$CX$110,0))),\"\",INDEX(funList,MATCH(ROW()-ROW($K$1),Function!$C$110:$CX$110,0)))","v":""},{"$f":"IF(ISERROR(INDEX(indexList,MATCH(ROW()-ROW($L$1),Index!$B$383:$CW$383,0))),\"\",INDEX(indexList,MATCH(ROW()-ROW($L$1),Index!$B$383:$CW$383,0)))","v":""},{"$f":"IF(ISERROR(INDEX(tabList,MATCH(ROW()-ROW($M$1)+MAX(Function!$C$110:$CX$110),FactorTable!$B$111:$GS$111,0))),\"\",INDEX(tabList,MATCH(ROW()-ROW($M$1)+MAX(Function!$C$110:$CX$110),FactorTable!$B$111:$GS$111,0)))","v":""}]
["Poisson",0,null,null,null,null,"osRatio",null,null,{"$f":"IF(ISERROR(INDEX(funList,MATCH(ROW()-2-ROW($J$1),Function!$C$110:$CX$110,0))),IF(ISERROR(INDEX(tabList,MATCH(ROW()-2-ROW($J$1),FactorTable!$B$111:$GS$111,0))),\"\",INDEX(tabList,MATCH(ROW()-2-ROW($J$1),FactorTable!$B$111:$GS$111,0))),INDEX(funList,MATCH(ROW()-2-ROW($J$1),Function!$C$110:$CX$110,0)))","v":"D1"},{"$f":"IF(ISERROR(INDEX(funList,MATCH(ROW()-ROW($K$1),Function!$C$110:$CX$110,0))),\"\",INDEX(funList,MATCH(ROW()-ROW($K$1),Function!$C$110:$CX$110,0)))","v":""},{"$f":"IF(ISERROR(INDEX(indexList,MATCH(ROW()-ROW($L$1),Index!$B$383:$CW$383,0))),\"\",INDEX(indexList,MATCH(ROW()-ROW($L$1),Index!$B$383:$CW$383,0)))","v":""},{"$f":"IF(ISERROR(INDEX(tabList,MATCH(ROW()-ROW($M$1)+MAX(Function!$C$110:$CX$110),FactorTable!$B$111:$GS$111,0))),\"\",INDEX(tabList,MATCH(ROW()-ROW($M$1)+MAX(Function!$C$110:$CX$110),FactorTable!$B$111:$GS$111,0)))","v":""}]
["Uniform",null,null,null,null,null,"Paid",null,null,{"$f":"IF(ISERROR(INDEX(funList,MATCH(ROW()-2-ROW($J$1),Function!$C$110:$CX$110,0))),IF(ISERROR(INDEX(tabList,MATCH(ROW()-2-ROW($J$1),FactorTable!$B$111:$GS$111,0))),\"\",INDEX(tabList,MATCH(ROW()-2-ROW($J$1),FactorTable!$B$111:$GS$111,0))),INDEX(funList,MATCH(ROW()-2-ROW($J$1),Function!$C$110:$CX$110,0)))","v":"D2"},{"$f":"IF(ISERROR(INDEX(funList,MATCH(ROW()-ROW($K$1),Function!$C$110:$CX$110,0))),\"\",INDEX(funList,MATCH(ROW()-ROW($K$1),Function!$C$110:$CX$110,0)))","v":""},{"$f":"IF(ISERROR(INDEX(indexList,MATCH(ROW()-ROW($L$1),Index!$B$383:$CW$383,0))),\"\",INDEX(indexList,MATCH(ROW()-ROW($L$1),Index!$B$383:$CW$383,0)))","v":""},{"$f":"IF(ISERROR(INDEX(tabList,MATCH(ROW()-ROW($M$1)+MAX(Function!$C$110:$CX$110),FactorTable!$B$111:$GS$111,0))),\"\",INDEX(tabList,MATCH(ROW()-ROW($M$1)+MAX(Function!$C$110:$CX$110),FactorTable!$B$111:$GS$111,0)))","v":""}]
["Weibull",0,null,0,null,null,"Deductible",null,null,{"$f":"IF(ISERROR(INDEX(funList,MATCH(ROW()-2-ROW($J$1),Function!$C$110:$CX$110,0))),IF(ISERROR(INDEX(tabList,MATCH(ROW()-2-ROW($J$1),FactorTable!$B$111:$GS$111,0))),\"\",INDEX(tabList,MATCH(ROW()-2-ROW($J$1),FactorTable!$B$111:$GS$111,0))),INDEX(funList,MATCH(ROW()-2-ROW($J$1),Function!$C$110:$CX$110,0)))","v":"D3"},{"$f":"IF(ISERROR(INDEX(funList,MATCH(ROW()-ROW($K$1),Function!$C$110:$CX$110,0))),\"\",INDEX(funList,MATCH(ROW()-ROW($K$1),Function!$C$110:$CX$110,0)))","v":""},{"$f":"IF(ISERROR(INDEX(indexList,MATCH(ROW()-ROW($L$1),Index!$B$383:$CW$383,0))),\"\",INDEX(indexList,MATCH(ROW()-ROW($L$1),Index!$B$383:$CW$383,0)))","v":""},{"$f":"IF(ISERROR(INDEX(tabList,MATCH(ROW()-ROW($M$1)+MAX(Function!$C$110:$CX$110),FactorTable!$B$111:$GS$111,0))),\"\",INDEX(tabList,MATCH(ROW()-ROW($M$1)+MAX(Function!$C$110:$CX$110),FactorTable!$B$111:$GS$111,0)))","v":""}]
["Empirical",null,null,null,null,null,"Limit",null,null,{"$f":"IF(ISERROR(INDEX(funList,MATCH(ROW()-2-ROW($J$1),Function!$C$110:$CX$110,0))),IF(ISERROR(INDEX(tabList,MATCH(ROW()-2-ROW($J$1),FactorTable!$B$111:$GS$111,0))),\"\",INDEX(tabList,MATCH(ROW()-2-ROW($J$1),FactorTable!$B$111:$GS$111,0))),INDEX(funList,MATCH(ROW()-2-ROW($J$1),Function!$C$110:$CX$110,0)))","v":"AutoPDp0"},{"$f":"IF(ISERROR(INDEX(funList,MATCH(ROW()-ROW($K$1),Function!$C$110:$CX$110,0))),\"\",INDEX(funList,MATCH(ROW()-ROW($K$1),Function!$C$110:$CX$110,0)))","v":""},{"$f":"IF(ISERROR(INDEX(indexList,MATCH(ROW()-ROW($L$1),Index!$B$383:$CW$383,0))),\"\",INDEX(indexList,MATCH(ROW()-ROW($L$1),Index!$B$383:$CW$383,0)))","v":""},{"$f":"IF(ISERROR(INDEX(tabList,MATCH(ROW()-ROW($M$1)+MAX(Function!$C$110:$CX$110),FactorTable!$B$111:$GS$111,0))),\"\",INDEX(tabList,MATCH(ROW()-ROW($M$1)+MAX(Function!$C$110:$CX$110),FactorTable!$B$111:$GS$111,0)))","v":""}]
[null,null,null,null,null,null,"totalLoss",null,null,{"$f":"IF(ISERROR(INDEX(funList,MATCH(ROW()-2-ROW($J$1),Function!$C$110:$CX$110,0))),IF(ISERROR(INDEX(tabList,MATCH(ROW()-2-ROW($J$1),FactorTable!$B$111:$GS$111,0))),\"\",INDEX(tabList,MATCH(ROW()-2-ROW($J$1),FactorTable!$B$111:$GS$111,0))),INDEX(funList,MATCH(ROW()-2-ROW($J$1),Function!$C$110:$CX$110,0)))","v":"HomeDwellingp0"},{"$f":"IF(ISERROR(INDEX(funList,MATCH(ROW()-ROW($K$1),Function!$C$110:$CX$110,0))),\"\",INDEX(funList,MATCH(ROW()-ROW($K$1),Function!$C$110:$CX$110,0)))","v":""},{"$f":"IF(ISERROR(INDEX(indexList,MATCH(ROW()-ROW($L$1),Index!$B$383:$CW$383,0))),\"\",INDEX(indexList,MATCH(ROW()-ROW($L$1),Index!$B$383:$CW$383,0)))","v":""},{"$f":"IF(ISERROR(INDEX(tabList,MATCH(ROW()-ROW($M$1)+MAX(Function!$C$110:$CX$110),FactorTable!$B$111:$GS$111,0))),\"\",INDEX(tabList,MATCH(ROW()-ROW($M$1)+MAX(Function!$C$110:$CX$110),FactorTable!$B$111:$GS$111,0)))","v":""}]
[null,null,null,null,null,null,"LAE",null,null,{"$f":"IF(ISERROR(INDEX(funList,MATCH(ROW()-2-ROW($J$1),Function!$C$110:$CX$110,0))),IF(ISERROR(INDEX(tabList,MATCH(ROW()-2-ROW($J$1),FactorTable!$B$111:$GS$111,0))),\"\",INDEX(tabList,MATCH(ROW()-2-ROW($J$1),FactorTable!$B$111:$GS$111,0))),INDEX(funList,MATCH(ROW()-2-ROW($J$1),Function!$C$110:$CX$110,0)))","v":""},{"$f":"IF(ISERROR(INDEX(funList,MATCH(ROW()-ROW($K$1),Function!$C$110:$CX$110,0))),\"\",INDEX(funList,MATCH(ROW()-ROW($K$1),Function!$C$110:$CX$110,0)))","v":""},{"$f":"IF(ISERROR(INDEX(indexList,MATCH(ROW()-ROW($L$1),Index!$B$383:$CW$383,0))),\"\",INDEX(indexList,MATCH(ROW()-ROW($L$1),Index!$B$383:$CW$383,0)))","v":""},{"$f":"IF(ISERROR(INDEX(tabList,MATCH(ROW()-ROW($M$1)+MAX(Function!$C$110:$CX$110),FactorTable!$B$111:$GS$111,0))),\"\",INDEX(tabList,MATCH(ROW()-ROW($M$1)+MAX(Function!$C$110:$CX$110),FactorTable!$B$111:$GS$111,0)))","v":""}]
[null,null,null,null,null,null,"claimLiability",null,null,{"$f":"IF(ISERROR(INDEX(funList,MATCH(ROW()-2-ROW($J$1),Function!$C$110:$CX$110,0))),IF(ISERROR(INDEX(tabList,MATCH(ROW()-2-ROW($J$1),FactorTable!$B$111:$GS$111,0))),\"\",INDEX(tabList,MATCH(ROW()-2-ROW($J$1),FactorTable!$B$111:$GS$111,0))),INDEX(funList,MATCH(ROW()-2-ROW($J$1),Function!$C$110:$CX$110,0)))","v":""},{"$f":"IF(ISERROR(INDEX(funList,MATCH(ROW()-ROW($K$1),Function!$C$110:$CX$110,0))),\"\",INDEX(funList,MATCH(ROW()-ROW($K$1),Function!$C$110:$CX$110,0)))","v":""},{"$f":"IF(ISERROR(INDEX(indexList,MATCH(ROW()-ROW($L$1),Index!$B$383:$CW$383,0))),\"\",INDEX(indexList,MATCH(ROW()-ROW($L$1),Index!$B$383:$CW$383,0)))","v":""},{"$f":"IF(ISERROR(INDEX(tabList,MATCH(ROW()-ROW($M$1)+MAX(Function!$C$110:$CX$110),FactorTable!$B$111:$GS$111,0))),\"\",INDEX(tabList,MATCH(ROW()-ROW($M$1)+MAX(Function!$C$110:$CX$110),FactorTable!$B$111:$GS$111,0)))","v":""}]
[null,null,null,null,null,null,null,null,null,{"$f":"IF(ISERROR(INDEX(funList,MATCH(ROW()-2-ROW($J$1),Function!$C$110:$CX$110,0))),IF(ISERROR(INDEX(tabList,MATCH(ROW()-2-ROW($J$1),FactorTable!$B$111:$GS$111,0))),\"\",INDEX(tabList,MATCH(ROW()-2-ROW($J$1),FactorTable!$B$111:$GS$111,0))),INDEX(funList,MATCH(ROW()-2-ROW($J$1),Function!$C$110:$CX$110,0)))","v":""},{"$f":"IF(ISERROR(INDEX(funList,MATCH(ROW()-ROW($K$1),Function!$C$110:$CX$110,0))),\"\",INDEX(funList,MATCH(ROW()-ROW($K$1),Function!$C$110:$CX$110,0)))","v":""},{"$f":"IF(ISERROR(INDEX(indexList,MATCH(ROW()-ROW($L$1),Index!$B$383:$CW$383,0))),\"\",INDEX(indexList,MATCH(ROW()-ROW($L$1),Index!$B$383:$CW$383,0)))","v":""},{"$f":"IF(ISERROR(INDEX(tabList,MATCH(ROW()-ROW($M$1)+MAX(Function!$C$110:$CX$110),FactorTable!$B$111:$GS$111,0))),\"\",INDEX(tabList,MATCH(ROW()-ROW($M$1)+MAX(Function!$C$110:$CX$110),FactorTable!$B$111:$GS$111,0)))","v":""}]
[null,null,null,null,null,null,null,null,null,{"$f":"IF(ISERROR(INDEX(funList,MATCH(ROW()-2-ROW($J$1),Function!$C$110:$CX$110,0))),IF(ISERROR(INDEX(tabList,MATCH(ROW()-2-ROW($J$1),FactorTable!$B$111:$GS$111,0))),\"\",INDEX(tabList,MATCH(ROW()-2-ROW($J$1),FactorTable!$B$111:$GS$111,0))),INDEX(funList,MATCH(ROW()-2-ROW($J$1),Function!$C$110:$CX$110,0)))","v":""},{"$f":"IF(ISERROR(INDEX(funList,MATCH(ROW()-ROW($K$1),Function!$C$110:$CX$110,0))),\"\",INDEX(funList,MATCH(ROW()-ROW($K$1),Function!$C$110:$CX$110,0)))","v":""},{"$f":"IF(ISERROR(INDEX(indexList,MATCH(ROW()-ROW($L$1),Index!$B$383:$CW$383,0))),\"\",INDEX(indexList,MATCH(ROW()-ROW($L$1),Index!$B$383:$CW$383,0)))","v":""},{"$f":"IF(ISERROR(INDEX(tabList,MATCH(ROW()-ROW($M$1)+MAX(Function!$C$110:$CX$110),FactorTable!$B$111:$GS$111,0))),\"\",INDEX(tabList,MATCH(ROW()-ROW($M$1)+MAX(Function!$C$110:$CX$110),FactorTable!$B$111:$GS$111,0)))","v":""}]
[null,null,null,null,null,null,null,null,null,{"$f":"IF(ISERROR(INDEX(funList,MATCH(ROW()-2-ROW($J$1),Function!$C$110:$CX$110,0))),IF(ISERROR(INDEX(tabList,MATCH(ROW()-2-ROW($J$1),FactorTable!$B$111:$GS$111,0))),\"\",INDEX(tabList,MATCH(ROW()-2-ROW($J$1),FactorTable!$B$111:$GS$111,0))),INDEX(funList,MATCH(ROW()-2-ROW($J$1),Function!$C$110:$CX$110,0)))","v":""},{"$f":"IF(ISERROR(INDEX(funList,MATCH(ROW()-ROW($K$1),Function!$C$110:$CX$110,0))),\"\",INDEX(funList,MATCH(ROW()-ROW($K$1),Function!$C$110:$CX$110,0)))","v":""},{"$f":"IF(ISERROR(INDEX(indexList,MATCH(ROW()-ROW($L$1),Index!$B$383:$CW$383,0))),\"\",INDEX(indexList,MATCH(ROW()-ROW($L$1),Index!$B$383:$CW$383,0)))","v":""},{"$f":"IF(ISERROR(INDEX(tabList,MATCH(ROW()-ROW($M$1)+MAX(Function!$C$110:$CX$110),FactorTable!$B$111:$GS$111,0))),\"\",INDEX(tabList,MATCH(ROW()-ROW($M$1)+MAX(Function!$C$110:$CX$110),FactorTable!$B$111:$GS$111,0)))","v":""}]
[null,null,null,null,null,null,null,null,null,{"$f":"IF(ISERROR(INDEX(funList,MATCH(ROW()-2-ROW($J$1),Function!$C$110:$CX$110,0))),IF(ISERROR(INDEX(tabList,MATCH(ROW()-2-ROW($J$1),FactorTable!$B$111:$GS$111,0))),\"\",INDEX(tabList,MATCH(ROW()-2-ROW($J$1),FactorTable!$B$111:$GS$111,0))),INDEX(funList,MATCH(ROW()-2-ROW($J$1),Function!$C$110:$CX$110,0)))","v":""},{"$f":"IF(ISERROR(INDEX(funList,MATCH(ROW()-ROW($K$1),Function!$C$110:$CX$110,0))),\"\",INDEX(funList,MATCH(ROW()-ROW($K$1),Function!$C$110:$CX$110,0)))","v":""},{"$f":"IF(ISERROR(INDEX(indexList,MATCH(ROW()-ROW($L$1),Index!$B$383:$CW$383,0))),\"\",INDEX(indexList,MATCH(ROW()-ROW($L$1),Index!$B$383:$CW$383,0)))","v":""},{"$f":"IF(ISERROR(INDEX(tabList,MATCH(ROW()-ROW($M$1)+MAX(Function!$C$110:$CX$110),FactorTable!$B$111:$GS$111,0))),\"\",INDEX(tabList,MATCH(ROW()-ROW($M$1)+MAX(Function!$C$110:$CX$110),FactorTable!$B$111:$GS$111,0)))","v":""}]
[null,null,null,null,null,null,null,null,null,{"$f":"IF(ISERROR(INDEX(funList,MATCH(ROW()-2-ROW($J$1),Function!$C$110:$CX$110,0))),IF(ISERROR(INDEX(tabList,MATCH(ROW()-2-ROW($J$1),FactorTable!$B$111:$GS$111,0))),\"\",INDEX(tabList,MATCH(ROW()-2-ROW($J$1),FactorTable!$B$111:$GS$111,0))),INDEX(funList,MATCH(ROW()-2-ROW($J$1),Function!$C$110:$CX$110,0)))","v":""},{"$f":"IF(ISERROR(INDEX(funList,MATCH(ROW()-ROW($K$1),Function!$C$110:$CX$110,0))),\"\",INDEX(funList,MATCH(ROW()-ROW($K$1),Function!$C$110:$CX$110,0)))","v":""},{"$f":"IF(ISERROR(INDEX(indexList,MATCH(ROW()-ROW($L$1),Index!$B$383:$CW$383,0))),\"\",INDEX(indexList,MATCH(ROW()-ROW($L$1),Index!$B$383:$CW$383,0)))","v":""},{"$f":"IF(ISERROR(INDEX(tabList,MATCH(ROW()-ROW($M$1)+MAX(Function!$C$110:$CX$110),FactorTable!$B$111:$GS$111,0))),\"\",INDEX(tabList,MATCH(ROW()-ROW($M$1)+MAX(Function!$C$110:$CX$110),FactorTable!$B$111:$GS$111,0)))","v":""}]
[null,null,null,null,null,null,null,null,null,{"$f":"IF(ISERROR(INDEX(funList,MATCH(ROW()-2-ROW($J$1),Function!$C$110:$CX$110,0))),IF(ISERROR(INDEX(tabList,MATCH(ROW()-2-ROW($J$1),FactorTable!$B$111:$GS$111,0))),\"\",INDEX(tabList,MATCH(ROW()-2-ROW($J$1),FactorTable!$B$111:$GS$111,0))),INDEX(funList,MATCH(ROW()-2-ROW($J$1),Function!$C$110:$CX$110,0)))","v":""},{"$f":"IF(ISERROR(INDEX(funList,MATCH(ROW()-ROW($K$1),Function!$C$110:$CX$110,0))),\"\",INDEX(funList,MATCH(ROW()-ROW($K$1),Function!$C$110:$CX$110,0)))","v":""},{"$f":"IF(ISERROR(INDEX(indexList,MATCH(ROW()-ROW($L$1),Index!$B$383:$CW$383,0))),\"\",INDEX(indexList,MATCH(ROW()-ROW($L$1),Index!$B$383:$CW$383,0)))","v":""},{"$f":"IF(ISERROR(INDEX(tabList,MATCH(ROW()-ROW($M$1)+MAX(Function!$C$110:$CX$110),FactorTable!$B$111:$GS$111,0))),\"\",INDEX(tabList,MATCH(ROW()-ROW($M$1)+MAX(Function!$C$110:$CX$110),FactorTable!$B$111:$GS$111,0)))","v":""}]
[null,null,null,null,null,null,null,null,null,{"$f":"IF(ISERROR(INDEX(funList,MATCH(ROW()-2-ROW($J$1),Function!$C$110:$CX$110,0))),IF(ISERROR(INDEX(tabList,MATCH(ROW()-2-ROW($J$1),FactorTable!$B$111:$GS$111,0))),\"\",INDEX(tabList,MATCH(ROW()-2-ROW($J$1),FactorTable!$B$111:$GS$111,0))),INDEX(funList,MATCH(ROW()-2-ROW($J$1),Function!$C$110:$CX$110,0)))","v":""},{"$f":"IF(ISERROR(INDEX(funList,MATCH(ROW()-ROW($K$1),Function!$C$110:$CX$110,0))),\"\",INDEX(funList,MATCH(ROW()-ROW($K$1),Function!$C$110:$CX$110,0)))","v":""},{"$f":"IF(ISERROR(INDEX(indexList,MATCH(ROW()-ROW($L$1),Index!$B$383:$CW$383,0))),\"\",INDEX(indexList,MATCH(ROW()-ROW($L$1),Index!$B$383:$CW$383,0)))","v":""},{"$f":"IF(ISERROR(INDEX(tabList,MATCH(ROW()-ROW($M$1)+MAX(Function!$C$110:$CX$110),FactorTable!$B$111:$GS$111,0))),\"\",INDEX(tabList,MATCH(ROW()-ROW($M$1)+MAX(Function!$C$110:$CX$110),FactorTable!$B$111:$GS$111,0)))","v":""}]
[null,null,null,null,null,null,null,null,null,{"$f":"IF(ISERROR(INDEX(funList,MATCH(ROW()-2-ROW($J$1),Function!$C$110:$CX$110,0))),IF(ISERROR(INDEX(tabList,MATCH(ROW()-2-ROW($J$1),FactorTable!$B$111:$GS$111,0))),\"\",INDEX(tabList,MATCH(ROW()-2-ROW($J$1),FactorTable!$B$111:$GS$111,0))),INDEX(funList,MATCH(ROW()-2-ROW($J$1),Function!$C$110:$CX$110,0)))","v":""},{"$f":"IF(ISERROR(INDEX(funList,MATCH(ROW()-ROW($K$1),Function!$C$110:$CX$110,0))),\"\",INDEX(funList,MATCH(ROW()-ROW($K$1),Function!$C$110:$CX$110,0)))","v":""},{"$f":"IF(ISERROR(INDEX(indexList,MATCH(ROW()-ROW($L$1),Index!$B$383:$CW$383,0))),\"\",INDEX(indexList,MATCH(ROW()-ROW($L$1),Index!$B$383:$CW$383,0)))","v":""},{"$f":"IF(ISERROR(INDEX(tabList,MATCH(ROW()-ROW($M$1)+MAX(Function!$C$110:$CX$110),FactorTable!$B$111:$GS$111,0))),\"\",INDEX(tabList,MATCH(ROW()-ROW($M$1)+MAX(Function!$C$110:$CX$110),FactorTable!$B$111:$GS$111,0)))","v":""}]
[null,null,null,null,null,null,null,null,null,{"$f":"IF(ISERROR(INDEX(funList,MATCH(ROW()-2-ROW($J$1),Function!$C$110:$CX$110,0))),IF(ISERROR(INDEX(tabList,MATCH(ROW()-2-ROW($J$1),FactorTable!$B$111:$GS$111,0))),\"\",INDEX(tabList,MATCH(ROW()-2-ROW($J$1),FactorTable!$B$111:$GS$111,0))),INDEX(funList,MATCH(ROW()-2-ROW($J$1),Function!$C$110:$CX$110,0)))","v":""},{"$f":"IF(ISERROR(INDEX(funList,MATCH(ROW()-ROW($K$1),Function!$C$110:$CX$110,0))),\"\",INDEX(funList,MATCH(ROW()-ROW($K$1),Function!$C$110:$CX$110,0)))","v":""},{"$f":"IF(ISERROR(INDEX(indexList,MATCH(ROW()-ROW($L$1),Index!$B$383:$CW$383,0))),\"\",INDEX(indexList,MATCH(ROW()-ROW($L$1),Index!$B$383:$CW$383,0)))","v":""},{"$f":"IF(ISERROR(INDEX(tabList,MATCH(ROW()-ROW($M$1)+MAX(Function!$C$110:$CX$110),FactorTable!$B$111:$GS$111,0))),\"\",INDEX(tabList,MATCH(ROW()-ROW($M$1)+MAX(Function!$C$110:$CX$110),FactorTable!$B$111:$GS$111,0)))","v":""}]
[null,null,null,null,null,null,null,null,null,{"$f":"IF(ISERROR(INDEX(funList,MATCH(ROW()-2-ROW($J$1),Function!$C$110:$CX$110,0))),IF(ISERROR(INDEX(tabList,MATCH(ROW()-2-ROW($J$1),FactorTable!$B$111:$GS$111,0))),\"\",INDEX(tabList,MATCH(ROW()-2-ROW($J$1),FactorTable!$B$111:$GS$111,0))),INDEX(funList,MATCH(ROW()-2-ROW($J$1),Function!$C$110:$CX$110,0)))","v":""},{"$f":"IF(ISERROR(INDEX(funList,MATCH(ROW()-ROW($K$1),Function!$C$110:$CX$110,0))),\"\",INDEX(funList,MATCH(ROW()-ROW($K$1),Function!$C$110:$CX$110,0)))","v":""},{"$f":"IF(ISERROR(INDEX(indexList,MATCH(ROW()-ROW($L$1),Index!$B$383:$CW$383,0))),\"\",INDEX(indexList,MATCH(ROW()-ROW($L$1),Index!$B$383:$CW$383,0)))","v":""},{"$f":"IF(ISERROR(INDEX(tabList,MATCH(ROW()-ROW($M$1)+MAX(Function!$C$110:$CX$110),FactorTable!$B$111:$GS$111,0))),\"\",INDEX(tabList,MATCH(ROW()-ROW($M$1)+MAX(Function!$C$110:$CX$110),FactorTable!$B$111:$GS$111,0)))","v":""}]
[null,null,null,null,null,null,null,null,null,{"$f":"IF(ISERROR(INDEX(funList,MATCH(ROW()-2-ROW($J$1),Function!$C$110:$CX$110,0))),IF(ISERROR(INDEX(tabList,MATCH(ROW()-2-ROW($J$1),FactorTable!$B$111:$GS$111,0))),\"\",INDEX(tabList,MATCH(ROW()-2-ROW($J$1),FactorTable!$B$111:$GS$111,0))),INDEX(funList,MATCH(ROW()-2-ROW($J$1),Function!$C$110:$CX$110,0)))","v":""},{"$f":"IF(ISERROR(INDEX(funList,MATCH(ROW()-ROW($K$1),Function!$C$110:$CX$110,0))),\"\",INDEX(funList,MATCH(ROW()-ROW($K$1),Function!$C$110:$CX$110,0)))","v":""},{"$f":"IF(ISERROR(INDEX(indexList,MATCH(ROW()-ROW($L$1),Index!$B$383:$CW$383,0))),\"\",INDEX(indexList,MATCH(ROW()-ROW($L$1),Index!$B$383:$CW$383,0)))","v":""},{"$f":"IF(ISERROR(INDEX(tabList,MATCH(ROW()-ROW($M$1)+MAX(Function!$C$110:$CX$110),FactorTable!$B$111:$GS$111,0))),\"\",INDEX(tabList,MATCH(ROW()-ROW($M$1)+MAX(Function!$C$110:$CX$110),FactorTable!$B$111:$GS$111,0)))","v":""}]
[null,null,null,null,null,null,null,null,null,{"$f":"IF(ISERROR(INDEX(funList,MATCH(ROW()-2-ROW($J$1),Function!$C$110:$CX$110,0))),IF(ISERROR(INDEX(tabList,MATCH(ROW()-2-ROW($J$1),FactorTable!$B$111:$GS$111,0))),\"\",INDEX(tabList,MATCH(ROW()-2-ROW($J$1),FactorTable!$B$111:$GS$111,0))),INDEX(funList,MATCH(ROW()-2-ROW($J$1),Function!$C$110:$CX$110,0)))","v":""},{"$f":"IF(ISERROR(INDEX(funList,MATCH(ROW()-ROW($K$1),Function!$C$110:$CX$110,0))),\"\",INDEX(funList,MATCH(ROW()-ROW($K$1),Function!$C$110:$CX$110,0)))","v":""},{"$f":"IF(ISERROR(INDEX(indexList,MATCH(ROW()-ROW($L$1),Index!$B$383:$CW$383,0))),\"\",INDEX(indexList,MATCH(ROW()-ROW($L$1),Index!$B$383:$CW$383,0)))","v":""},{"$f":"IF(ISERROR(INDEX(tabList,MATCH(ROW()-ROW($M$1)+MAX(Function!$C$110:$CX$110),FactorTable!$B$111:$GS$111,0))),\"\",INDEX(tabList,MATCH(ROW()-ROW($M$1)+MAX(Function!$C$110:$CX$110),FactorTable!$B$111:$GS$111,0)))","v":""}]
[null,null,null,null,null,null,null,null,null,{"$f":"IF(ISERROR(INDEX(funList,MATCH(ROW()-ROW($J$1),Function!$C$110:$CX$110,0))),IF(ISERROR(INDEX(tabList,MATCH(ROW()-ROW($J$1),FactorTable!$B$111:$GS$111,0))),\"\",INDEX(tabList,MATCH(ROW()-ROW($J$1),FactorTable!$B$111:$GS$111,0))),INDEX(funList,MATCH(ROW()-ROW($J$1),Function!$C$110:$CX$110,0)))","v":""},{"$f":"IF(ISERROR(INDEX(funList,MATCH(ROW()-ROW($K$1),Function!$C$110:$CX$110,0))),\"\",INDEX(funList,MATCH(ROW()-ROW($K$1),Function!$C$110:$CX$110,0)))","v":""},{"$f":"IF(ISERROR(INDEX(indexList,MATCH(ROW()-ROW($L$1),Index!$B$383:$CW$383,0))),\"\",INDEX(indexList,MATCH(ROW()-ROW($L$1),Index!$B$383:$CW$383,0)))","v":""},{"$f":"IF(ISERROR(INDEX(funList,MATCH(ROW()-ROW($K$1),Function!$C$110:$CX$110,0))),\"\",INDEX(funList,MATCH(ROW()-ROW($K$1),Function!$C$110:$CX$110,0)))","v":""}]
[null,null,null,null,null,null,null,null,null,{"$f":"IF(ISERROR(INDEX(funList,MATCH(ROW()-ROW($J$1),Function!$C$110:$CX$110,0))),IF(ISERROR(INDEX(tabList,MATCH(ROW()-ROW($J$1),FactorTable!$B$111:$GS$111,0))),\"\",INDEX(tabList,MATCH(ROW()-ROW($J$1),FactorTable!$B$111:$GS$111,0))),INDEX(funList,MATCH(ROW()-ROW($J$1),Function!$C$110:$CX$110,0)))","v":""},{"$f":"IF(ISERROR(INDEX(funList,MATCH(ROW()-ROW($K$1),Function!$C$110:$CX$110,0))),\"\",INDEX(funList,MATCH(ROW()-ROW($K$1),Function!$C$110:$CX$110,0)))","v":""},{"$f":"IF(ISERROR(INDEX(indexList,MATCH(ROW()-ROW($L$1),Index!$B$383:$CW$383,0))),\"\",INDEX(indexList,MATCH(ROW()-ROW($L$1),Index!$B$383:$CW$383,0)))","v":""},{"$f":"IF(ISERROR(INDEX(funList,MATCH(ROW()-ROW($K$1),Function!$C$110:$CX$110,0))),\"\",INDEX(funList,MATCH(ROW()-ROW($K$1),Function!$C$110:$CX$110,0)))","v":""}]
[null,null,null,null,null,null,null,null,null,{"$f":"IF(ISERROR(INDEX(funList,MATCH(ROW()-ROW($J$1),Function!$C$110:$CX$110,0))),IF(ISERROR(INDEX(tabList,MATCH(ROW()-ROW($J$1),FactorTable!$B$111:$GS$111,0))),\"\",INDEX(tabList,MATCH(ROW()-ROW($J$1),FactorTable!$B$111:$GS$111,0))),INDEX(funList,MATCH(ROW()-ROW($J$1),Function!$C$110:$CX$110,0)))","v":""},{"$f":"IF(ISERROR(INDEX(funList,MATCH(ROW()-ROW($K$1),Function!$C$110:$CX$110,0))),\"\",INDEX(funList,MATCH(ROW()-ROW($K$1),Function!$C$110:$CX$110,0)))","v":""},{"$f":"IF(ISERROR(INDEX(indexList,MATCH(ROW()-ROW($L$1),Index!$B$383:$CW$383,0))),\"\",INDEX(indexList,MATCH(ROW()-ROW($L$1),Index!$B$383:$CW$383,0)))","v":""},{"$f":"IF(ISERROR(INDEX(funList,MATCH(ROW()-ROW($K$1),Function!$C$110:$CX$110,0))),\"\",INDEX(funList,MATCH(ROW()-ROW($K$1),Function!$C$110:$CX$110,0)))","v":""}]
[null,null,null,null,null,null,null,null,null,{"$f":"IF(ISERROR(INDEX(funList,MATCH(ROW()-ROW($J$1),Function!$C$110:$CX$110,0))),IF(ISERROR(INDEX(tabList,MATCH(ROW()-ROW($J$1),FactorTable!$B$111:$GS$111,0))),\"\",INDEX(tabList,MATCH(ROW()-ROW($J$1),FactorTable!$B$111:$GS$111,0))),INDEX(funList,MATCH(ROW()-ROW($J$1),Function!$C$110:$CX$110,0)))","v":""},{"$f":"IF(ISERROR(INDEX(funList,MATCH(ROW()-ROW($K$1),Function!$C$110:$CX$110,0))),\"\",INDEX(funList,MATCH(ROW()-ROW($K$1),Function!$C$110:$CX$110,0)))","v":""},{"$f":"IF(ISERROR(INDEX(indexList,MATCH(ROW()-ROW($L$1),Index!$B$383:$CW$383,0))),\"\",INDEX(indexList,MATCH(ROW()-ROW($L$1),Index!$B$383:$CW$383,0)))","v":""},{"$f":"IF(ISERROR(INDEX(funList,MATCH(ROW()-ROW($K$1),Function!$C$110:$CX$110,0))),\"\",INDEX(funList,MATCH(ROW()-ROW($K$1),Function!$C$110:$CX$110,0)))","v":""}]
[null,null,null,null,null,null,null,null,null,{"$f":"IF(ISERROR(INDEX(funList,MATCH(ROW()-ROW($J$1),Function!$C$110:$CX$110,0))),IF(ISERROR(INDEX(tabList,MATCH(ROW()-ROW($J$1),FactorTable!$B$111:$GS$111,0))),\"\",INDEX(tabList,MATCH(ROW()-ROW($J$1),FactorTable!$B$111:$GS$111,0))),INDEX(funList,MATCH(ROW()-ROW($J$1),Function!$C$110:$CX$110,0)))","v":""},{"$f":"IF(ISERROR(INDEX(funList,MATCH(ROW()-ROW($K$1),Function!$C$110:$CX$110,0))),\"\",INDEX(funList,MATCH(ROW()-ROW($K$1),Function!$C$110:$CX$110,0)))","v":""},{"$f":"IF(ISERROR(INDEX(indexList,MATCH(ROW()-ROW($L$1),Index!$B$383:$CW$383,0))),\"\",INDEX(indexList,MATCH(ROW()-ROW($L$1),Index!$B$383:$CW$383,0)))","v":""},{"$f":"IF(ISERROR(INDEX(funList,MATCH(ROW()-ROW($K$1),Function!$C$110:$CX$110,0))),\"\",INDEX(funList,MATCH(ROW()-ROW($K$1),Function!$C$110:$CX$110,0)))","v":""}]
[null,null,null,null,null,null,null,null,null,{"$f":"IF(ISERROR(INDEX(funList,MATCH(ROW()-ROW($J$1),Function!$C$110:$CX$110,0))),IF(ISERROR(INDEX(tabList,MATCH(ROW()-ROW($J$1),FactorTable!$B$111:$GS$111,0))),\"\",INDEX(tabList,MATCH(ROW()-ROW($J$1),FactorTable!$B$111:$GS$111,0))),INDEX(funList,MATCH(ROW()-ROW($J$1),Function!$C$110:$CX$110,0)))","v":""},{"$f":"IF(ISERROR(INDEX(funList,MATCH(ROW()-ROW($K$1),Function!$C$110:$CX$110,0))),\"\",INDEX(funList,MATCH(ROW()-ROW($K$1),Function!$C$110:$CX$110,0)))","v":""},{"$f":"IF(ISERROR(INDEX(indexList,MATCH(ROW()-ROW($L$1),Index!$B$383:$CW$383,0))),\"\",INDEX(indexList,MATCH(ROW()-ROW($L$1),Index!$B$383:$CW$383,0)))","v":""},{"$f":"IF(ISERROR(INDEX(funList,MATCH(ROW()-ROW($K$1),Function!$C$110:$CX$110,0))),\"\",INDEX(funList,MATCH(ROW()-ROW($K$1),Function!$C$110:$CX$110,0)))","v":""}]
[null,null,null,null,null,null,null,null,null,{"$f":"IF(ISERROR(INDEX(funList,MATCH(ROW()-ROW($J$1),Function!$C$110:$CX$110,0))),IF(ISERROR(INDEX(tabList,MATCH(ROW()-ROW($J$1),FactorTable!$B$111:$GS$111,0))),\"\",INDEX(tabList,MATCH(ROW()-ROW($J$1),FactorTable!$B$111:$GS$111,0))),INDEX(funList,MATCH(ROW()-ROW($J$1),Function!$C$110:$CX$110,0)))","v":""},{"$f":"IF(ISERROR(INDEX(funList,MATCH(ROW()-ROW($K$1),Function!$C$110:$CX$110,0))),\"\",INDEX(funList,MATCH(ROW()-ROW($K$1),Function!$C$110:$CX$110,0)))","v":""},{"$f":"IF(ISERROR(INDEX(indexList,MATCH(ROW()-ROW($L$1),Index!$B$383:$CW$383,0))),\"\",INDEX(indexList,MATCH(ROW()-ROW($L$1),Index!$B$383:$CW$383,0)))","v":""},{"$f":"IF(ISERROR(INDEX(funList,MATCH(ROW()-ROW($K$1),Function!$C$110:$CX$110,0))),\"\",INDEX(funList,MATCH(ROW()-ROW($K$1),Function!$C$110:$CX$110,0)))","v":""}]
[null,null,null,null,null,null,null,null,null,{"$f":"IF(ISERROR(INDEX(funList,MATCH(ROW()-ROW($J$1),Function!$C$110:$CX$110,0))),IF(ISERROR(INDEX(tabList,MATCH(ROW()-ROW($J$1),FactorTable!$B$111:$GS$111,0))),\"\",INDEX(tabList,MATCH(ROW()-ROW($J$1),FactorTable!$B$111:$GS$111,0))),INDEX(funList,MATCH(ROW()-ROW($J$1),Function!$C$110:$CX$110,0)))","v":""},{"$f":"IF(ISERROR(INDEX(funList,MATCH(ROW()-ROW($K$1),Function!$C$110:$CX$110,0))),\"\",INDEX(funList,MATCH(ROW()-ROW($K$1),Function!$C$110:$CX$110,0)))","v":""},{"$f":"IF(ISERROR(INDEX(indexList,MATCH(ROW()-ROW($L$1),Index!$B$383:$CW$383,0))),\"\",INDEX(indexList,MATCH(ROW()-ROW($L$1),Index!$B$383:$CW$383,0)))","v":""},{"$f":"IF(ISERROR(INDEX(funList,MATCH(ROW()-ROW($K$1),Function!$C$110:$CX$110,0))),\"\",INDEX(funList,MATCH(ROW()-ROW($K$1),Function!$C$110:$CX$110,0)))","v":""}]
[null,null,null,null,null,null,null,null,null,{"$f":"IF(ISERROR(INDEX(funList,MATCH(ROW()-ROW($J$1),Function!$C$110:$CX$110,0))),IF(ISERROR(INDEX(tabList,MATCH(ROW()-ROW($J$1),FactorTable!$B$111:$GS$111,0))),\"\",INDEX(tabList,MATCH(ROW()-ROW($J$1),FactorTable!$B$111:$GS$111,0))),INDEX(funList,MATCH(ROW()-ROW($J$1),Function!$C$110:$CX$110,0)))","v":""},{"$f":"IF(ISERROR(INDEX(funList,MATCH(ROW()-ROW($K$1),Function!$C$110:$CX$110,0))),\"\",INDEX(funList,MATCH(ROW()-ROW($K$1),Function!$C$110:$CX$110,0)))","v":""},{"$f":"IF(ISERROR(INDEX(indexList,MATCH(ROW()-ROW($L$1),Index!$B$383:$CW$383,0))),\"\",INDEX(indexList,MATCH(ROW()-ROW($L$1),Index!$B$383:$CW$383,0)))","v":""},{"$f":"IF(ISERROR(INDEX(funList,MATCH(ROW()-ROW($K$1),Function!$C$110:$CX$110,0))),\"\",INDEX(funList,MATCH(ROW()-ROW($K$1),Function!$C$110:$CX$110,0)))","v":""}]
[null,null,null,null,null,null,null,null,null,{"$f":"IF(ISERROR(INDEX(funList,MATCH(ROW()-ROW($J$1),Function!$C$110:$CX$110,0))),IF(ISERROR(INDEX(tabList,MATCH(ROW()-ROW($J$1),FactorTable!$B$111:$GS$111,0))),\"\",INDEX(tabList,MATCH(ROW()-ROW($J$1),FactorTable!$B$111:$GS$111,0))),INDEX(funList,MATCH(ROW()-ROW($J$1),Function!$C$110:$CX$110,0)))","v":""},{"$f":"IF(ISERROR(INDEX(funList,MATCH(ROW()-ROW($K$1),Function!$C$110:$CX$110,0))),\"\",INDEX(funList,MATCH(ROW()-ROW($K$1),Function!$C$110:$CX$110,0)))","v":""},{"$f":"IF(ISERROR(INDEX(indexList,MATCH(ROW()-ROW($L$1),Index!$B$383:$CW$383,0))),\"\",INDEX(indexList,MATCH(ROW()-ROW($L$1),Index!$B$383:$CW$383,0)))","v":""},{"$f":"IF(ISERROR(INDEX(funList,MATCH(ROW()-ROW($K$1),Function!$C$110:$CX$110,0))),\"\",INDEX(funList,MATCH(ROW()-ROW($K$1),Function!$C$110:$CX$110,0)))","v":""}]
[null,null,null,null,null,null,null,null,null,{"$f":"IF(ISERROR(INDEX(funList,MATCH(ROW()-ROW($J$1),Function!$C$110:$CX$110,0))),IF(ISERROR(INDEX(tabList,MATCH(ROW()-ROW($J$1),FactorTable!$B$111:$GS$111,0))),\"\",INDEX(tabList,MATCH(ROW()-ROW($J$1),FactorTable!$B$111:$GS$111,0))),INDEX(funList,MATCH(ROW()-ROW($J$1),Function!$C$110:$CX$110,0)))","v":""},{"$f":"IF(ISERROR(INDEX(funList,MATCH(ROW()-ROW($K$1),Function!$C$110:$CX$110,0))),\"\",INDEX(funList,MATCH(ROW()-ROW($K$1),Function!$C$110:$CX$110,0)))","v":""},{"$f":"IF(ISERROR(INDEX(indexList,MATCH(ROW()-ROW($L$1),Index!$B$383:$CW$383,0))),\"\",INDEX(indexList,MATCH(ROW()-ROW($L$1),Index!$B$383:$CW$383,0)))","v":""},{"$f":"IF(ISERROR(INDEX(funList,MATCH(ROW()-ROW($K$1),Function!$C$110:$CX$110,0))),\"\",INDEX(funList,MATCH(ROW()-ROW($K$1),Function!$C$110:$CX$110,0)))","v":""}]
[null,null,null,null,null,null,null,null,null,{"$f":"IF(ISERROR(INDEX(funList,MATCH(ROW()-ROW($J$1),Function!$C$110:$CX$110,0))),IF(ISERROR(INDEX(tabList,MATCH(ROW()-ROW($J$1),FactorTable!$B$111:$GS$111,0))),\"\",INDEX(tabList,MATCH(ROW()-ROW($J$1),FactorTable!$B$111:$GS$111,0))),INDEX(funList,MATCH(ROW()-ROW($J$1),Function!$C$110:$CX$110,0)))","v":""},{"$f":"IF(ISERROR(INDEX(funList,MATCH(ROW()-ROW($K$1),Function!$C$110:$CX$110,0))),\"\",INDEX(funList,MATCH(ROW()-ROW($K$1),Function!$C$110:$CX$110,0)))","v":""},{"$f":"IF(ISERROR(INDEX(indexList,MATCH(ROW()-ROW($L$1),Index!$B$383:$CW$383,0))),\"\",INDEX(indexList,MATCH(ROW()-ROW($L$1),Index!$B$383:$CW$383,0)))","v":""},{"$f":"IF(ISERROR(INDEX(funList,MATCH(ROW()-ROW($K$1),Function!$C$110:$CX$110,0))),\"\",INDEX(funList,MATCH(ROW()-ROW($K$1),Function!$C$110:$CX$110,0)))","v":""}]
[null,null,null,null,null,null,null,null,null,{"$f":"IF(ISERROR(INDEX(funList,MATCH(ROW()-ROW($J$1),Function!$C$110:$CX$110,0))),IF(ISERROR(INDEX(tabList,MATCH(ROW()-ROW($J$1),FactorTable!$B$111:$GS$111,0))),\"\",INDEX(tabList,MATCH(ROW()-ROW($J$1),FactorTable!$B$111:$GS$111,0))),INDEX(funList,MATCH(ROW()-ROW($J$1),Function!$C$110:$CX$110,0)))","v":""},{"$f":"IF(ISERROR(INDEX(funList,MATCH(ROW()-ROW($K$1),Function!$C$110:$CX$110,0))),\"\",INDEX(funList,MATCH(ROW()-ROW($K$1),Function!$C$110:$CX$110,0)))","v":""},{"$f":"IF(ISERROR(INDEX(indexList,MATCH(ROW()-ROW($L$1),Index!$B$383:$CW$383,0))),\"\",INDEX(indexList,MATCH(ROW()-ROW($L$1),Index!$B$383:$CW$383,0)))","v":""},{"$f":"IF(ISERROR(INDEX(funList,MATCH(ROW()-ROW($K$1),Function!$C$110:$CX$110,0))),\"\",INDEX(funList,MATCH(ROW()-ROW($K$1),Function!$C$110:$CX$110,0)))","v":""}]
[null,null,null,null,null,null,null,null,null,{"$f":"IF(ISERROR(INDEX(funList,MATCH(ROW()-ROW($J$1),Function!$C$110:$CX$110,0))),IF(ISERROR(INDEX(tabList,MATCH(ROW()-ROW($J$1),FactorTable!$B$111:$GS$111,0))),\"\",INDEX(tabList,MATCH(ROW()-ROW($J$1),FactorTable!$B$111:$GS$111,0))),INDEX(funList,MATCH(ROW()-ROW($J$1),Function!$C$110:$CX$110,0)))","v":""},{"$f":"IF(ISERROR(INDEX(funList,MATCH(ROW()-ROW($K$1),Function!$C$110:$CX$110,0))),\"\",INDEX(funList,MATCH(ROW()-ROW($K$1),Function!$C$110:$CX$110,0)))","v":""},{"$f":"IF(ISERROR(INDEX(indexList,MATCH(ROW()-ROW($L$1),Index!$B$383:$CW$383,0))),\"\",INDEX(indexList,MATCH(ROW()-ROW($L$1),Index!$B$383:$CW$383,0)))","v":""},{"$f":"IF(ISERROR(INDEX(funList,MATCH(ROW()-ROW($K$1),Function!$C$110:$CX$110,0))),\"\",INDEX(funList,MATCH(ROW()-ROW($K$1),Function!$C$110:$CX$110,0)))","v":""}]
[null,null,null,null,null,null,null,null,null,{"$f":"IF(ISERROR(INDEX(funList,MATCH(ROW()-ROW($J$1),Function!$C$110:$CX$110,0))),IF(ISERROR(INDEX(tabList,MATCH(ROW()-ROW($J$1),FactorTable!$B$111:$GS$111,0))),\"\",INDEX(tabList,MATCH(ROW()-ROW($J$1),FactorTable!$B$111:$GS$111,0))),INDEX(funList,MATCH(ROW()-ROW($J$1),Function!$C$110:$CX$110,0)))","v":""},{"$f":"IF(ISERROR(INDEX(funList,MATCH(ROW()-ROW($K$1),Function!$C$110:$CX$110,0))),\"\",INDEX(funList,MATCH(ROW()-ROW($K$1),Function!$C$110:$CX$110,0)))","v":""},{"$f":"IF(ISERROR(INDEX(indexList,MATCH(ROW()-ROW($L$1),Index!$B$383:$CW$383,0))),\"\",INDEX(indexList,MATCH(ROW()-ROW($L$1),Index!$B$383:$CW$383,0)))","v":""},{"$f":"IF(ISERROR(INDEX(funList,MATCH(ROW()-ROW($K$1),Function!$C$110:$CX$110,0))),\"\",INDEX(funList,MATCH(ROW()-ROW($K$1),Function!$C$110:$CX$110,0)))","v":""}]
[null,null,null,null,null,null,null,null,null,{"$f":"IF(ISERROR(INDEX(funList,MATCH(ROW()-ROW($J$1),Function!$C$110:$CX$110,0))),IF(ISERROR(INDEX(tabList,MATCH(ROW()-ROW($J$1),FactorTable!$B$111:$GS$111,0))),\"\",INDEX(tabList,MATCH(ROW()-ROW($J$1),FactorTable!$B$111:$GS$111,0))),INDEX(funList,MATCH(ROW()-ROW($J$1),Function!$C$110:$CX$110,0)))","v":""},{"$f":"IF(ISERROR(INDEX(funList,MATCH(ROW()-ROW($K$1),Function!$C$110:$CX$110,0))),\"\",INDEX(funList,MATCH(ROW()-ROW($K$1),Function!$C$110:$CX$110,0)))","v":""},{"$f":"IF(ISERROR(INDEX(indexList,MATCH(ROW()-ROW($L$1),Index!$B$383:$CW$383,0))),\"\",INDEX(indexList,MATCH(ROW()-ROW($L$1),Index!$B$383:$CW$383,0)))","v":""},{"$f":"IF(ISERROR(INDEX(funList,MATCH(ROW()-ROW($K$1),Function!$C$110:$CX$110,0))),\"\",INDEX(funList,MATCH(ROW()-ROW($K$1),Function!$C$110:$CX$110,0)))","v":""}]
[null,null,null,null,null,null,null,null,null,{"$f":"IF(ISERROR(INDEX(funList,MATCH(ROW()-ROW($J$1),Function!$C$110:$CX$110,0))),IF(ISERROR(INDEX(tabList,MATCH(ROW()-ROW($J$1),FactorTable!$B$111:$GS$111,0))),\"\",INDEX(tabList,MATCH(ROW()-ROW($J$1),FactorTable!$B$111:$GS$111,0))),INDEX(funList,MATCH(ROW()-ROW($J$1),Function!$C$110:$CX$110,0)))","v":""},{"$f":"IF(ISERROR(INDEX(funList,MATCH(ROW()-ROW($K$1),Function!$C$110:$CX$110,0))),\"\",INDEX(funList,MATCH(ROW()-ROW($K$1),Function!$C$110:$CX$110,0)))","v":""},{"$f":"IF(ISERROR(INDEX(indexList,MATCH(ROW()-ROW($L$1),Index!$B$383:$CW$383,0))),\"\",INDEX(indexList,MATCH(ROW()-ROW($L$1),Index!$B$383:$CW$383,0)))","v":""},{"$f":"IF(ISERROR(INDEX(funList,MATCH(ROW()-ROW($K$1),Function!$C$110:$CX$110,0))),\"\",INDEX(funList,MATCH(ROW()-ROW($K$1),Function!$C$110:$CX$110,0)))","v":""}]
[null,null,null,null,null,null,null,null,null,{"$f":"IF(ISERROR(INDEX(funList,MATCH(ROW()-ROW($J$1),Function!$C$110:$CX$110,0))),IF(ISERROR(INDEX(tabList,MATCH(ROW()-ROW($J$1),FactorTable!$B$111:$GS$111,0))),\"\",INDEX(tabList,MATCH(ROW()-ROW($J$1),FactorTable!$B$111:$GS$111,0))),INDEX(funList,MATCH(ROW()-ROW($J$1),Function!$C$110:$CX$110,0)))","v":""},{"$f":"IF(ISERROR(INDEX(funList,MATCH(ROW()-ROW($K$1),Function!$C$110:$CX$110,0))),\"\",INDEX(funList,MATCH(ROW()-ROW($K$1),Function!$C$110:$CX$110,0)))","v":""},{"$f":"IF(ISERROR(INDEX(indexList,MATCH(ROW()-ROW($L$1),Index!$B$383:$CW$383,0))),\"\",INDEX(indexList,MATCH(ROW()-ROW($L$1),Index!$B$383:$CW$383,0)))","v":""},{"$f":"IF(ISERROR(INDEX(funList,MATCH(ROW()-ROW($K$1),Function!$C$110:$CX$110,0))),\"\",INDEX(funList,MATCH(ROW()-ROW($K$1),Function!$C$110:$CX$110,0)))","v":""}]
[null,null,null,null,null,null,null,null,null,{"$f":"IF(ISERROR(INDEX(funList,MATCH(ROW()-ROW($J$1),Function!$C$110:$CX$110,0))),IF(ISERROR(INDEX(tabList,MATCH(ROW()-ROW($J$1),FactorTable!$B$111:$GS$111,0))),\"\",INDEX(tabList,MATCH(ROW()-ROW($J$1),FactorTable!$B$111:$GS$111,0))),INDEX(funList,MATCH(ROW()-ROW($J$1),Function!$C$110:$CX$110,0)))","v":""},{"$f":"IF(ISERROR(INDEX(funList,MATCH(ROW()-ROW($K$1),Function!$C$110:$CX$110,0))),\"\",INDEX(funList,MATCH(ROW()-ROW($K$1),Function!$C$110:$CX$110,0)))","v":""},{"$f":"IF(ISERROR(INDEX(indexList,MATCH(ROW()-ROW($L$1),Index!$B$383:$CW$383,0))),\"\",INDEX(indexList,MATCH(ROW()-ROW($L$1),Index!$B$383:$CW$383,0)))","v":""},{"$f":"IF(ISERROR(INDEX(funList,MATCH(ROW()-ROW($K$1),Function!$C$110:$CX$110,0))),\"\",INDEX(funList,MATCH(ROW()-ROW($K$1),Function!$C$110:$CX$110,0)))","v":""}]
[null,null,null,null,null,null,null,null,null,{"$f":"IF(ISERROR(INDEX(funList,MATCH(ROW()-ROW($J$1),Function!$C$110:$CX$110,0))),IF(ISERROR(INDEX(tabList,MATCH(ROW()-ROW($J$1),FactorTable!$B$111:$GS$111,0))),\"\",INDEX(tabList,MATCH(ROW()-ROW($J$1),FactorTable!$B$111:$GS$111,0))),INDEX(funList,MATCH(ROW()-ROW($J$1),Function!$C$110:$CX$110,0)))","v":""},{"$f":"IF(ISERROR(INDEX(funList,MATCH(ROW()-ROW($K$1),Function!$C$110:$CX$110,0))),\"\",INDEX(funList,MATCH(ROW()-ROW($K$1),Function!$C$110:$CX$110,0)))","v":""},{"$f":"IF(ISERROR(INDEX(indexList,MATCH(ROW()-ROW($L$1),Index!$B$383:$CW$383,0))),\"\",INDEX(indexList,MATCH(ROW()-ROW($L$1),Index!$B$383:$CW$383,0)))","v":""},{"$f":"IF(ISERROR(INDEX(funList,MATCH(ROW()-ROW($K$1),Function!$C$110:$CX$110,0))),\"\",INDEX(funList,MATCH(ROW()-ROW($K$1),Function!$C$110:$CX$110,0)))","v":""}]
[null,null,null,null,null,null,null,null,null,{"$f":"IF(ISERROR(INDEX(funList,MATCH(ROW()-ROW($J$1),Function!$C$110:$CX$110,0))),IF(ISERROR(INDEX(tabList,MATCH(ROW()-ROW($J$1),FactorTable!$B$111:$GS$111,0))),\"\",INDEX(tabList,MATCH(ROW()-ROW($J$1),FactorTable!$B$111:$GS$111,0))),INDEX(funList,MATCH(ROW()-ROW($J$1),Function!$C$110:$CX$110,0)))","v":""},{"$f":"IF(ISERROR(INDEX(funList,MATCH(ROW()-ROW($K$1),Function!$C$110:$CX$110,0))),\"\",INDEX(funList,MATCH(ROW()-ROW($K$1),Function!$C$110:$CX$110,0)))","v":""},{"$f":"IF(ISERROR(INDEX(indexList,MATCH(ROW()-ROW($L$1),Index!$B$383:$CW$383,0))),\"\",INDEX(indexList,MATCH(ROW()-ROW($L$1),Index!$B$383:$CW$383,0)))","v":""},{"$f":"IF(ISERROR(INDEX(funList,MATCH(ROW()-ROW($K$1),Function!$C$110:$CX$110,0))),\"\",INDEX(funList,MATCH(ROW()-ROW($K$1),Function!$C$110:$CX$110,0)))","v":""}]
[null,null,null,null,null,null,null,null,null,{"$f":"IF(ISERROR(INDEX(funList,MATCH(ROW()-ROW($J$1),Function!$C$110:$CX$110,0))),IF(ISERROR(INDEX(tabList,MATCH(ROW()-ROW($J$1),FactorTable!$B$111:$GS$111,0))),\"\",INDEX(tabList,MATCH(ROW()-ROW($J$1),FactorTable!$B$111:$GS$111,0))),INDEX(funList,MATCH(ROW()-ROW($J$1),Function!$C$110:$CX$110,0)))","v":""},{"$f":"IF(ISERROR(INDEX(funList,MATCH(ROW()-ROW($K$1),Function!$C$110:$CX$110,0))),\"\",INDEX(funList,MATCH(ROW()-ROW($K$1),Function!$C$110:$CX$110,0)))","v":""},{"$f":"IF(ISERROR(INDEX(indexList,MATCH(ROW()-ROW($L$1),Index!$B$383:$CW$383,0))),\"\",INDEX(indexList,MATCH(ROW()-ROW($L$1),Index!$B$383:$CW$383,0)))","v":""},{"$f":"IF(ISERROR(INDEX(funList,MATCH(ROW()-ROW($K$1),Function!$C$110:$CX$110,0))),\"\",INDEX(funList,MATCH(ROW()-ROW($K$1),Function!$C$110:$CX$110,0)))","v":""}]
[null,null,null,null,null,null,null,null,null,{"$f":"IF(ISERROR(INDEX(funList,MATCH(ROW()-ROW($J$1),Function!$C$110:$CX$110,0))),IF(ISERROR(INDEX(tabList,MATCH(ROW()-ROW($J$1),FactorTable!$B$111:$GS$111,0))),\"\",INDEX(tabList,MATCH(ROW()-ROW($J$1),FactorTable!$B$111:$GS$111,0))),INDEX(funList,MATCH(ROW()-ROW($J$1),Function!$C$110:$CX$110,0)))","v":""},{"$f":"IF(ISERROR(INDEX(funList,MATCH(ROW()-ROW($K$1),Function!$C$110:$CX$110,0))),\"\",INDEX(funList,MATCH(ROW()-ROW($K$1),Function!$C$110:$CX$110,0)))","v":""},{"$f":"IF(ISERROR(INDEX(indexList,MATCH(ROW()-ROW($L$1),Index!$B$383:$CW$383,0))),\"\",INDEX(indexList,MATCH(ROW()-ROW($L$1),Index!$B$383:$CW$383,0)))","v":""},{"$f":"IF(ISERROR(INDEX(funList,MATCH(ROW()-ROW($K$1),Function!$C$110:$CX$110,0))),\"\",INDEX(funList,MATCH(ROW()-ROW($K$1),Function!$C$110:$CX$110,0)))","v":""}]
[null,null,null,null,null,null,null,null,null,{"$f":"IF(ISERROR(INDEX(funList,MATCH(ROW()-ROW($J$1),Function!$C$110:$CX$110,0))),IF(ISERROR(INDEX(tabList,MATCH(ROW()-ROW($J$1),FactorTable!$B$111:$GS$111,0))),\"\",INDEX(tabList,MATCH(ROW()-ROW($J$1),FactorTable!$B$111:$GS$111,0))),INDEX(funList,MATCH(ROW()-ROW($J$1),Function!$C$110:$CX$110,0)))","v":""},{"$f":"IF(ISERROR(INDEX(funList,MATCH(ROW()-ROW($K$1),Function!$C$110:$CX$110,0))),\"\",INDEX(funList,MATCH(ROW()-ROW($K$1),Function!$C$110:$CX$110,0)))","v":""},{"$f":"IF(ISERROR(INDEX(indexList,MATCH(ROW()-ROW($L$1),Index!$B$383:$CW$383,0))),\"\",INDEX(indexList,MATCH(ROW()-ROW($L$1),Index!$B$383:$CW$383,0)))","v":""},{"$f":"IF(ISERROR(INDEX(funList,MATCH(ROW()-ROW($K$1),Function!$C$110:$CX$110,0))),\"\",INDEX(funList,MATCH(ROW()-ROW($K$1),Function!$C$110:$CX$110,0)))","v":""}]
[null,null,null,null,null,null,null,null,null,{"$f":"IF(ISERROR(INDEX(funList,MATCH(ROW()-ROW($J$1),Function!$C$110:$CX$110,0))),IF(ISERROR(INDEX(tabList,MATCH(ROW()-ROW($J$1),FactorTable!$B$111:$GS$111,0))),\"\",INDEX(tabList,MATCH(ROW()-ROW($J$1),FactorTable!$B$111:$GS$111,0))),INDEX(funList,MATCH(ROW()-ROW($J$1),Function!$C$110:$CX$110,0)))","v":""},{"$f":"IF(ISERROR(INDEX(funList,MATCH(ROW()-ROW($K$1),Function!$C$110:$CX$110,0))),\"\",INDEX(funList,MATCH(ROW()-ROW($K$1),Function!$C$110:$CX$110,0)))","v":""},{"$f":"IF(ISERROR(INDEX(indexList,MATCH(ROW()-ROW($L$1),Index!$B$383:$CW$383,0))),\"\",INDEX(indexList,MATCH(ROW()-ROW($L$1),Index!$B$383:$CW$383,0)))","v":""},{"$f":"IF(ISERROR(INDEX(funList,MATCH(ROW()-ROW($K$1),Function!$C$110:$CX$110,0))),\"\",INDEX(funList,MATCH(ROW()-ROW($K$1),Function!$C$110:$CX$110,0)))","v":""}]
[null,null,null,null,null,null,null,null,null,{"$f":"IF(ISERROR(INDEX(funList,MATCH(ROW()-ROW($J$1),Function!$C$110:$CX$110,0))),IF(ISERROR(INDEX(tabList,MATCH(ROW()-ROW($J$1),FactorTable!$B$111:$GS$111,0))),\"\",INDEX(tabList,MATCH(ROW()-ROW($J$1),FactorTable!$B$111:$GS$111,0))),INDEX(funList,MATCH(ROW()-ROW($J$1),Function!$C$110:$CX$110,0)))","v":""},{"$f":"IF(ISERROR(INDEX(funList,MATCH(ROW()-ROW($K$1),Function!$C$110:$CX$110,0))),\"\",INDEX(funList,MATCH(ROW()-ROW($K$1),Function!$C$110:$CX$110,0)))","v":""},{"$f":"IF(ISERROR(INDEX(indexList,MATCH(ROW()-ROW($L$1),Index!$B$383:$CW$383,0))),\"\",INDEX(indexList,MATCH(ROW()-ROW($L$1),Index!$B$383:$CW$383,0)))","v":""},{"$f":"IF(ISERROR(INDEX(funList,MATCH(ROW()-ROW($K$1),Function!$C$110:$CX$110,0))),\"\",INDEX(funList,MATCH(ROW()-ROW($K$1),Function!$C$110:$CX$110,0)))","v":""}]
[null,null,null,null,null,null,null,null,null,{"$f":"IF(ISERROR(INDEX(funList,MATCH(ROW()-ROW($J$1),Function!$C$110:$CX$110,0))),IF(ISERROR(INDEX(tabList,MATCH(ROW()-ROW($J$1),FactorTable!$B$111:$GS$111,0))),\"\",INDEX(tabList,MATCH(ROW()-ROW($J$1),FactorTable!$B$111:$GS$111,0))),INDEX(funList,MATCH(ROW()-ROW($J$1),Function!$C$110:$CX$110,0)))","v":""},{"$f":"IF(ISERROR(INDEX(funList,MATCH(ROW()-ROW($K$1),Function!$C$110:$CX$110,0))),\"\",INDEX(funList,MATCH(ROW()-ROW($K$1),Function!$C$110:$CX$110,0)))","v":""},{"$f":"IF(ISERROR(INDEX(indexList,MATCH(ROW()-ROW($L$1),Index!$B$383:$CW$383,0))),\"\",INDEX(indexList,MATCH(ROW()-ROW($L$1),Index!$B$383:$CW$383,0)))","v":""},{"$f":"IF(ISERROR(INDEX(funList,MATCH(ROW()-ROW($K$1),Function!$C$110:$CX$110,0))),\"\",INDEX(funList,MATCH(ROW()-ROW($K$1),Function!$C$110:$CX$110,0)))","v":""}]
[null,null,null,null,null,null,null,null,null,{"$f":"IF(ISERROR(INDEX(funList,MATCH(ROW()-ROW($J$1),Function!$C$110:$CX$110,0))),IF(ISERROR(INDEX(tabList,MATCH(ROW()-ROW($J$1),FactorTable!$B$111:$GS$111,0))),\"\",INDEX(tabList,MATCH(ROW()-ROW($J$1),FactorTable!$B$111:$GS$111,0))),INDEX(funList,MATCH(ROW()-ROW($J$1),Function!$C$110:$CX$110,0)))","v":""},{"$f":"IF(ISERROR(INDEX(funList,MATCH(ROW()-ROW($K$1),Function!$C$110:$CX$110,0))),\"\",INDEX(funList,MATCH(ROW()-ROW($K$1),Function!$C$110:$CX$110,0)))","v":""},{"$f":"IF(ISERROR(INDEX(indexList,MATCH(ROW()-ROW($L$1),Index!$B$383:$CW$383,0))),\"\",INDEX(indexList,MATCH(ROW()-ROW($L$1),Index!$B$383:$CW$383,0)))","v":""},{"$f":"IF(ISERROR(INDEX(funList,MATCH(ROW()-ROW($K$1),Function!$C$110:$CX$110,0))),\"\",INDEX(funList,MATCH(ROW()-ROW($K$1),Function!$C$110:$CX$110,0)))","v":""}]
[null,null,null,null,null,null,null,null,null,{"$f":"IF(ISERROR(INDEX(funList,MATCH(ROW()-ROW($J$1),Function!$C$110:$CX$110,0))),IF(ISERROR(INDEX(tabList,MATCH(ROW()-ROW($J$1),FactorTable!$B$111:$GS$111,0))),\"\",INDEX(tabList,MATCH(ROW()-ROW($J$1),FactorTable!$B$111:$GS$111,0))),INDEX(funList,MATCH(ROW()-ROW($J$1),Function!$C$110:$CX$110,0)))","v":""},{"$f":"IF(ISERROR(INDEX(funList,MATCH(ROW()-ROW($K$1),Function!$C$110:$CX$110,0))),\"\",INDEX(funList,MATCH(ROW()-ROW($K$1),Function!$C$110:$CX$110,0)))","v":""},{"$f":"IF(ISERROR(INDEX(indexList,MATCH(ROW()-ROW($L$1),Index!$B$383:$CW$383,0))),\"\",INDEX(indexList,MATCH(ROW()-ROW($L$1),Index!$B$383:$CW$383,0)))","v":""},{"$f":"IF(ISERROR(INDEX(funList,MATCH(ROW()-ROW($K$1),Function!$C$110:$CX$110,0))),\"\",INDEX(funList,MATCH(ROW()-ROW($K$1),Function!$C$110:$CX$110,0)))","v":""}]
[null,null,null,null,null,null,null,null,null,{"$f":"IF(ISERROR(INDEX(funList,MATCH(ROW()-ROW($J$1),Function!$C$110:$CX$110,0))),IF(ISERROR(INDEX(tabList,MATCH(ROW()-ROW($J$1),FactorTable!$B$111:$GS$111,0))),\"\",INDEX(tabList,MATCH(ROW()-ROW($J$1),FactorTable!$B$111:$GS$111,0))),INDEX(funList,MATCH(ROW()-ROW($J$1),Function!$C$110:$CX$110,0)))","v":""},{"$f":"IF(ISERROR(INDEX(funList,MATCH(ROW()-ROW($K$1),Function!$C$110:$CX$110,0))),\"\",INDEX(funList,MATCH(ROW()-ROW($K$1),Function!$C$110:$CX$110,0)))","v":""},{"$f":"IF(ISERROR(INDEX(indexList,MATCH(ROW()-ROW($L$1),Index!$B$383:$CW$383,0))),\"\",INDEX(indexList,MATCH(ROW()-ROW($L$1),Index!$B$383:$CW$383,0)))","v":""},{"$f":"IF(ISERROR(INDEX(funList,MATCH(ROW()-ROW($K$1),Function!$C$110:$CX$110,0))),\"\",INDEX(funList,MATCH(ROW()-ROW($K$1),Function!$C$110:$CX$110,0)))","v":""}]
[null,null,null,null,null,null,null,null,null,{"$f":"IF(ISERROR(INDEX(funList,MATCH(ROW()-ROW($J$1),Function!$C$110:$CX$110,0))),IF(ISERROR(INDEX(tabList,MATCH(ROW()-ROW($J$1),FactorTable!$B$111:$GS$111,0))),\"\",INDEX(tabList,MATCH(ROW()-ROW($J$1),FactorTable!$B$111:$GS$111,0))),INDEX(funList,MATCH(ROW()-ROW($J$1),Function!$C$110:$CX$110,0)))","v":""},{"$f":"IF(ISERROR(INDEX(funList,MATCH(ROW()-ROW($K$1),Function!$C$110:$CX$110,0))),\"\",INDEX(funList,MATCH(ROW()-ROW($K$1),Function!$C$110:$CX$110,0)))","v":""},{"$f":"IF(ISERROR(INDEX(indexList,MATCH(ROW()-ROW($L$1),Index!$B$383:$CW$383,0))),\"\",INDEX(indexList,MATCH(ROW()-ROW($L$1),Index!$B$383:$CW$383,0)))","v":""},{"$f":"IF(ISERROR(INDEX(funList,MATCH(ROW()-ROW($K$1),Function!$C$110:$CX$110,0))),\"\",INDEX(funList,MATCH(ROW()-ROW($K$1),Function!$C$110:$CX$110,0)))","v":""}]
[null,null,null,null,null,null,null,null,null,{"$f":"IF(ISERROR(INDEX(funList,MATCH(ROW()-ROW($J$1),Function!$C$110:$CX$110,0))),IF(ISERROR(INDEX(tabList,MATCH(ROW()-ROW($J$1),FactorTable!$B$111:$GS$111,0))),\"\",INDEX(tabList,MATCH(ROW()-ROW($J$1),FactorTable!$B$111:$GS$111,0))),INDEX(funList,MATCH(ROW()-ROW($J$1),Function!$C$110:$CX$110,0)))","v":""},{"$f":"IF(ISERROR(INDEX(funList,MATCH(ROW()-ROW($K$1),Function!$C$110:$CX$110,0))),\"\",INDEX(funList,MATCH(ROW()-ROW($K$1),Function!$C$110:$CX$110,0)))","v":""},{"$f":"IF(ISERROR(INDEX(indexList,MATCH(ROW()-ROW($L$1),Index!$B$383:$CW$383,0))),\"\",INDEX(indexList,MATCH(ROW()-ROW($L$1),Index!$B$383:$CW$383,0)))","v":""},{"$f":"IF(ISERROR(INDEX(funList,MATCH(ROW()-ROW($K$1),Function!$C$110:$CX$110,0))),\"\",INDEX(funList,MATCH(ROW()-ROW($K$1),Function!$C$110:$CX$110,0)))","v":""}]
[null,null,null,null,null,null,null,null,null,{"$f":"IF(ISERROR(INDEX(funList,MATCH(ROW()-ROW($J$1),Function!$C$110:$CX$110,0))),IF(ISERROR(INDEX(tabList,MATCH(ROW()-ROW($J$1),FactorTable!$B$111:$GS$111,0))),\"\",INDEX(tabList,MATCH(ROW()-ROW($J$1),FactorTable!$B$111:$GS$111,0))),INDEX(funList,MATCH(ROW()-ROW($J$1),Function!$C$110:$CX$110,0)))","v":""},{"$f":"IF(ISERROR(INDEX(funList,MATCH(ROW()-ROW($K$1),Function!$C$110:$CX$110,0))),\"\",INDEX(funList,MATCH(ROW()-ROW($K$1),Function!$C$110:$CX$110,0)))","v":""},{"$f":"IF(ISERROR(INDEX(indexList,MATCH(ROW()-ROW($L$1),Index!$B$383:$CW$383,0))),\"\",INDEX(indexList,MATCH(ROW()-ROW($L$1),Index!$B$383:$CW$383,0)))","v":""},{"$f":"IF(ISERROR(INDEX(funList,MATCH(ROW()-ROW($K$1),Function!$C$110:$CX$110,0))),\"\",INDEX(funList,MATCH(ROW()-ROW($K$1),Function!$C$110:$CX$110,0)))","v":""}]
[null,null,null,null,null,null,null,null,null,{"$f":"IF(ISERROR(INDEX(funList,MATCH(ROW()-ROW($J$1),Function!$C$110:$CX$110,0))),IF(ISERROR(INDEX(tabList,MATCH(ROW()-ROW($J$1),FactorTable!$B$111:$GS$111,0))),\"\",INDEX(tabList,MATCH(ROW()-ROW($J$1),FactorTable!$B$111:$GS$111,0))),INDEX(funList,MATCH(ROW()-ROW($J$1),Function!$C$110:$CX$110,0)))","v":""},{"$f":"IF(ISERROR(INDEX(funList,MATCH(ROW()-ROW($K$1),Function!$C$110:$CX$110,0))),\"\",INDEX(funList,MATCH(ROW()-ROW($K$1),Function!$C$110:$CX$110,0)))","v":""},{"$f":"IF(ISERROR(INDEX(indexList,MATCH(ROW()-ROW($L$1),Index!$B$383:$CW$383,0))),\"\",INDEX(indexList,MATCH(ROW()-ROW($L$1),Index!$B$383:$CW$383,0)))","v":""},{"$f":"IF(ISERROR(INDEX(funList,MATCH(ROW()-ROW($K$1),Function!$C$110:$CX$110,0))),\"\",INDEX(funList,MATCH(ROW()-ROW($K$1),Function!$C$110:$CX$110,0)))","v":""}]
[null,null,null,null,null,null,null,null,null,{"$f":"IF(ISERROR(INDEX(funList,MATCH(ROW()-ROW($J$1),Function!$C$110:$CX$110,0))),IF(ISERROR(INDEX(tabList,MATCH(ROW()-ROW($J$1),FactorTable!$B$111:$GS$111,0))),\"\",INDEX(tabList,MATCH(ROW()-ROW($J$1),FactorTable!$B$111:$GS$111,0))),INDEX(funList,MATCH(ROW()-ROW($J$1),Function!$C$110:$CX$110,0)))","v":""},{"$f":"IF(ISERROR(INDEX(funList,MATCH(ROW()-ROW($K$1),Function!$C$110:$CX$110,0))),\"\",INDEX(funList,MATCH(ROW()-ROW($K$1),Function!$C$110:$CX$110,0)))","v":""},{"$f":"IF(ISERROR(INDEX(indexList,MATCH(ROW()-ROW($L$1),Index!$B$383:$CW$383,0))),\"\",INDEX(indexList,MATCH(ROW()-ROW($L$1),Index!$B$383:$CW$383,0)))","v":""},{"$f":"IF(ISERROR(INDEX(funList,MATCH(ROW()-ROW($K$1),Function!$C$110:$CX$110,0))),\"\",INDEX(funList,MATCH(ROW()-ROW($K$1),Function!$C$110:$CX$110,0)))","v":""}]
[null,null,null,null,null,null,null,null,null,{"$f":"IF(ISERROR(INDEX(funList,MATCH(ROW()-ROW($J$1),Function!$C$110:$CX$110,0))),IF(ISERROR(INDEX(tabList,MATCH(ROW()-ROW($J$1),FactorTable!$B$111:$GS$111,0))),\"\",INDEX(tabList,MATCH(ROW()-ROW($J$1),FactorTable!$B$111:$GS$111,0))),INDEX(funList,MATCH(ROW()-ROW($J$1),Function!$C$110:$CX$110,0)))","v":""},{"$f":"IF(ISERROR(INDEX(funList,MATCH(ROW()-ROW($K$1),Function!$C$110:$CX$110,0))),\"\",INDEX(funList,MATCH(ROW()-ROW($K$1),Function!$C$110:$CX$110,0)))","v":""},{"$f":"IF(ISERROR(INDEX(indexList,MATCH(ROW()-ROW($L$1),Index!$B$383:$CW$383,0))),\"\",INDEX(indexList,MATCH(ROW()-ROW($L$1),Index!$B$383:$CW$383,0)))","v":""},{"$f":"IF(ISERROR(INDEX(funList,MATCH(ROW()-ROW($K$1),Function!$C$110:$CX$110,0))),\"\",INDEX(funList,MATCH(ROW()-ROW($K$1),Function!$C$110:$CX$110,0)))","v":""}]
[null,null,null,null,null,null,null,null,null,{"$f":"IF(ISERROR(INDEX(funList,MATCH(ROW()-ROW($J$1),Function!$C$110:$CX$110,0))),IF(ISERROR(INDEX(tabList,MATCH(ROW()-ROW($J$1),FactorTable!$B$111:$GS$111,0))),\"\",INDEX(tabList,MATCH(ROW()-ROW($J$1),FactorTable!$B$111:$GS$111,0))),INDEX(funList,MATCH(ROW()-ROW($J$1),Function!$C$110:$CX$110,0)))","v":""},{"$f":"IF(ISERROR(INDEX(funList,MATCH(ROW()-ROW($K$1),Function!$C$110:$CX$110,0))),\"\",INDEX(funList,MATCH(ROW()-ROW($K$1),Function!$C$110:$CX$110,0)))","v":""},{"$f":"IF(ISERROR(INDEX(indexList,MATCH(ROW()-ROW($L$1),Index!$B$383:$CW$383,0))),\"\",INDEX(indexList,MATCH(ROW()-ROW($L$1),Index!$B$383:$CW$383,0)))","v":""},{"$f":"IF(ISERROR(INDEX(funList,MATCH(ROW()-ROW($K$1),Function!$C$110:$CX$110,0))),\"\",INDEX(funList,MATCH(ROW()-ROW($K$1),Function!$C$110:$CX$110,0)))","v":""}]
[null,null,null,null,null,null,null,null,null,{"$f":"IF(ISERROR(INDEX(funList,MATCH(ROW()-ROW($J$1),Function!$C$110:$CX$110,0))),IF(ISERROR(INDEX(tabList,MATCH(ROW()-ROW($J$1),FactorTable!$B$111:$GS$111,0))),\"\",INDEX(tabList,MATCH(ROW()-ROW($J$1),FactorTable!$B$111:$GS$111,0))),INDEX(funList,MATCH(ROW()-ROW($J$1),Function!$C$110:$CX$110,0)))","v":""},{"$f":"IF(ISERROR(INDEX(funList,MATCH(ROW()-ROW($K$1),Function!$C$110:$CX$110,0))),\"\",INDEX(funList,MATCH(ROW()-ROW($K$1),Function!$C$110:$CX$110,0)))","v":""},{"$f":"IF(ISERROR(INDEX(indexList,MATCH(ROW()-ROW($L$1),Index!$B$383:$CW$383,0))),\"\",INDEX(indexList,MATCH(ROW()-ROW($L$1),Index!$B$383:$CW$383,0)))","v":""},{"$f":"IF(ISERROR(INDEX(funList,MATCH(ROW()-ROW($K$1),Function!$C$110:$CX$110,0))),\"\",INDEX(funList,MATCH(ROW()-ROW($K$1),Function!$C$110:$CX$110,0)))","v":""}]
[null,null,null,null,null,null,null,null,null,{"$f":"IF(ISERROR(INDEX(funList,MATCH(ROW()-ROW($J$1),Function!$C$110:$CX$110,0))),IF(ISERROR(INDEX(tabList,MATCH(ROW()-ROW($J$1),FactorTable!$B$111:$GS$111,0))),\"\",INDEX(tabList,MATCH(ROW()-ROW($J$1),FactorTable!$B$111:$GS$111,0))),INDEX(funList,MATCH(ROW()-ROW($J$1),Function!$C$110:$CX$110,0)))","v":""},{"$f":"IF(ISERROR(INDEX(funList,MATCH(ROW()-ROW($K$1),Function!$C$110:$CX$110,0))),\"\",INDEX(funList,MATCH(ROW()-ROW($K$1),Function!$C$110:$CX$110,0)))","v":""},{"$f":"IF(ISERROR(INDEX(indexList,MATCH(ROW()-ROW($L$1),Index!$B$383:$CW$383,0))),\"\",INDEX(indexList,MATCH(ROW()-ROW($L$1),Index!$B$383:$CW$383,0)))","v":""},{"$f":"IF(ISERROR(INDEX(funList,MATCH(ROW()-ROW($K$1),Function!$C$110:$CX$110,0))),\"\",INDEX(funList,MATCH(ROW()-ROW($K$1),Function!$C$110:$CX$110,0)))","v":""}]
[null,null,null,null,null,null,null,null,null,{"$f":"IF(ISERROR(INDEX(funList,MATCH(ROW()-ROW($J$1),Function!$C$110:$CX$110,0))),IF(ISERROR(INDEX(tabList,MATCH(ROW()-ROW($J$1),FactorTable!$B$111:$GS$111,0))),\"\",INDEX(tabList,MATCH(ROW()-ROW($J$1),FactorTable!$B$111:$GS$111,0))),INDEX(funList,MATCH(ROW()-ROW($J$1),Function!$C$110:$CX$110,0)))","v":""},{"$f":"IF(ISERROR(INDEX(funList,MATCH(ROW()-ROW($K$1),Function!$C$110:$CX$110,0))),\"\",INDEX(funList,MATCH(ROW()-ROW($K$1),Function!$C$110:$CX$110,0)))","v":""},{"$f":"IF(ISERROR(INDEX(indexList,MATCH(ROW()-ROW($L$1),Index!$B$383:$CW$383,0))),\"\",INDEX(indexList,MATCH(ROW()-ROW($L$1),Index!$B$383:$CW$383,0)))","v":""},{"$f":"IF(ISERROR(INDEX(funList,MATCH(ROW()-ROW($K$1),Function!$C$110:$CX$110,0))),\"\",INDEX(funList,MATCH(ROW()-ROW($K$1),Function!$C$110:$CX$110,0)))","v":""}]
[null,null,null,null,null,null,null,null,null,{"$f":"IF(ISERROR(INDEX(funList,MATCH(ROW()-ROW($J$1),Function!$C$110:$CX$110,0))),IF(ISERROR(INDEX(tabList,MATCH(ROW()-ROW($J$1),FactorTable!$B$111:$GS$111,0))),\"\",INDEX(tabList,MATCH(ROW()-ROW($J$1),FactorTable!$B$111:$GS$111,0))),INDEX(funList,MATCH(ROW()-ROW($J$1),Function!$C$110:$CX$110,0)))","v":""},{"$f":"IF(ISERROR(INDEX(funList,MATCH(ROW()-ROW($K$1),Function!$C$110:$CX$110,0))),\"\",INDEX(funList,MATCH(ROW()-ROW($K$1),Function!$C$110:$CX$110,0)))","v":""},{"$f":"IF(ISERROR(INDEX(indexList,MATCH(ROW()-ROW($L$1),Index!$B$383:$CW$383,0))),\"\",INDEX(indexList,MATCH(ROW()-ROW($L$1),Index!$B$383:$CW$383,0)))","v":""},{"$f":"IF(ISERROR(INDEX(funList,MATCH(ROW()-ROW($K$1),Function!$C$110:$CX$110,0))),\"\",INDEX(funList,MATCH(ROW()-ROW($K$1),Function!$C$110:$CX$110,0)))","v":""}]
[null,null,null,null,null,null,null,null,null,{"$f":"IF(ISERROR(INDEX(funList,MATCH(ROW()-ROW($J$1),Function!$C$110:$CX$110,0))),IF(ISERROR(INDEX(tabList,MATCH(ROW()-ROW($J$1),FactorTable!$B$111:$GS$111,0))),\"\",INDEX(tabList,MATCH(ROW()-ROW($J$1),FactorTable!$B$111:$GS$111,0))),INDEX(funList,MATCH(ROW()-ROW($J$1),Function!$C$110:$CX$110,0)))","v":""},{"$f":"IF(ISERROR(INDEX(funList,MATCH(ROW()-ROW($K$1),Function!$C$110:$CX$110,0))),\"\",INDEX(funList,MATCH(ROW()-ROW($K$1),Function!$C$110:$CX$110,0)))","v":""},{"$f":"IF(ISERROR(INDEX(indexList,MATCH(ROW()-ROW($L$1),Index!$B$383:$CW$383,0))),\"\",INDEX(indexList,MATCH(ROW()-ROW($L$1),Index!$B$383:$CW$383,0)))","v":""},{"$f":"IF(ISERROR(INDEX(funList,MATCH(ROW()-ROW($K$1),Function!$C$110:$CX$110,0))),\"\",INDEX(funList,MATCH(ROW()-ROW($K$1),Function!$C$110:$CX$110,0)))","v":""}]
[null,null,null,null,null,null,null,null,null,{"$f":"IF(ISERROR(INDEX(funList,MATCH(ROW()-ROW($J$1),Function!$C$110:$CX$110,0))),IF(ISERROR(INDEX(tabList,MATCH(ROW()-ROW($J$1),FactorTable!$B$111:$GS$111,0))),\"\",INDEX(tabList,MATCH(ROW()-ROW($J$1),FactorTable!$B$111:$GS$111,0))),INDEX(funList,MATCH(ROW()-ROW($J$1),Function!$C$110:$CX$110,0)))","v":""},{"$f":"IF(ISERROR(INDEX(funList,MATCH(ROW()-ROW($K$1),Function!$C$110:$CX$110,0))),\"\",INDEX(funList,MATCH(ROW()-ROW($K$1),Function!$C$110:$CX$110,0)))","v":""},{"$f":"IF(ISERROR(INDEX(indexList,MATCH(ROW()-ROW($L$1),Index!$B$383:$CW$383,0))),\"\",INDEX(indexList,MATCH(ROW()-ROW($L$1),Index!$B$383:$CW$383,0)))","v":""},{"$f":"IF(ISERROR(INDEX(funList,MATCH(ROW()-ROW($K$1),Function!$C$110:$CX$110,0))),\"\",INDEX(funList,MATCH(ROW()-ROW($K$1),Function!$C$110:$CX$110,0)))","v":""}]
[null,null,null,null,null,null,null,null,null,{"$f":"IF(ISERROR(INDEX(funList,MATCH(ROW()-ROW($J$1),Function!$C$110:$CX$110,0))),IF(ISERROR(INDEX(tabList,MATCH(ROW()-ROW($J$1),FactorTable!$B$111:$GS$111,0))),\"\",INDEX(tabList,MATCH(ROW()-ROW($J$1),FactorTable!$B$111:$GS$111,0))),INDEX(funList,MATCH(ROW()-ROW($J$1),Function!$C$110:$CX$110,0)))","v":""},{"$f":"IF(ISERROR(INDEX(funList,MATCH(ROW()-ROW($K$1),Function!$C$110:$CX$110,0))),\"\",INDEX(funList,MATCH(ROW()-ROW($K$1),Function!$C$110:$CX$110,0)))","v":""},{"$f":"IF(ISERROR(INDEX(indexList,MATCH(ROW()-ROW($L$1),Index!$B$383:$CW$383,0))),\"\",INDEX(indexList,MATCH(ROW()-ROW($L$1),Index!$B$383:$CW$383,0)))","v":""},{"$f":"IF(ISERROR(INDEX(funList,MATCH(ROW()-ROW($K$1),Function!$C$110:$CX$110,0))),\"\",INDEX(funList,MATCH(ROW()-ROW($K$1),Function!$C$110:$CX$110,0)))","v":""}]
[null,null,null,null,null,null,null,null,null,{"$f":"IF(ISERROR(INDEX(funList,MATCH(ROW()-ROW($J$1),Function!$C$110:$CX$110,0))),IF(ISERROR(INDEX(tabList,MATCH(ROW()-ROW($J$1),FactorTable!$B$111:$GS$111,0))),\"\",INDEX(tabList,MATCH(ROW()-ROW($J$1),FactorTable!$B$111:$GS$111,0))),INDEX(funList,MATCH(ROW()-ROW($J$1),Function!$C$110:$CX$110,0)))","v":""},{"$f":"IF(ISERROR(INDEX(funList,MATCH(ROW()-ROW($K$1),Function!$C$110:$CX$110,0))),\"\",INDEX(funList,MATCH(ROW()-ROW($K$1),Function!$C$110:$CX$110,0)))","v":""},{"$f":"IF(ISERROR(INDEX(indexList,MATCH(ROW()-ROW($L$1),Index!$B$383:$CW$383,0))),\"\",INDEX(indexList,MATCH(ROW()-ROW($L$1),Index!$B$383:$CW$383,0)))","v":""},{"$f":"IF(ISERROR(INDEX(funList,MATCH(ROW()-ROW($K$1),Function!$C$110:$CX$110,0))),\"\",INDEX(funList,MATCH(ROW()-ROW($K$1),Function!$C$110:$CX$110,0)))","v":""}]
[null,null,null,null,null,null,null,null,null,{"$f":"IF(ISERROR(INDEX(funList,MATCH(ROW()-ROW($J$1),Function!$C$110:$CX$110,0))),IF(ISERROR(INDEX(tabList,MATCH(ROW()-ROW($J$1),FactorTable!$B$111:$GS$111,0))),\"\",INDEX(tabList,MATCH(ROW()-ROW($J$1),FactorTable!$B$111:$GS$111,0))),INDEX(funList,MATCH(ROW()-ROW($J$1),Function!$C$110:$CX$110,0)))","v":""},{"$f":"IF(ISERROR(INDEX(funList,MATCH(ROW()-ROW($K$1),Function!$C$110:$CX$110,0))),\"\",INDEX(funList,MATCH(ROW()-ROW($K$1),Function!$C$110:$CX$110,0)))","v":""},{"$f":"IF(ISERROR(INDEX(indexList,MATCH(ROW()-ROW($L$1),Index!$B$383:$CW$383,0))),\"\",INDEX(indexList,MATCH(ROW()-ROW($L$1),Index!$B$383:$CW$383,0)))","v":""},{"$f":"IF(ISERROR(INDEX(funList,MATCH(ROW()-ROW($K$1),Function!$C$110:$CX$110,0))),\"\",INDEX(funList,MATCH(ROW()-ROW($K$1),Function!$C$110:$CX$110,0)))","v":""}]
[null,null,null,null,null,null,null,null,null,{"$f":"IF(ISERROR(INDEX(funList,MATCH(ROW()-ROW($J$1),Function!$C$110:$CX$110,0))),IF(ISERROR(INDEX(tabList,MATCH(ROW()-ROW($J$1),FactorTable!$B$111:$GS$111,0))),\"\",INDEX(tabList,MATCH(ROW()-ROW($J$1),FactorTable!$B$111:$GS$111,0))),INDEX(funList,MATCH(ROW()-ROW($J$1),Function!$C$110:$CX$110,0)))","v":""},{"$f":"IF(ISERROR(INDEX(funList,MATCH(ROW()-ROW($K$1),Function!$C$110:$CX$110,0))),\"\",INDEX(funList,MATCH(ROW()-ROW($K$1),Function!$C$110:$CX$110,0)))","v":""},{"$f":"IF(ISERROR(INDEX(indexList,MATCH(ROW()-ROW($L$1),Index!$B$383:$CW$383,0))),\"\",INDEX(indexList,MATCH(ROW()-ROW($L$1),Index!$B$383:$CW$383,0)))","v":""},{"$f":"IF(ISERROR(INDEX(funList,MATCH(ROW()-ROW($K$1),Function!$C$110:$CX$110,0))),\"\",INDEX(funList,MATCH(ROW()-ROW($K$1),Function!$C$110:$CX$110,0)))","v":""}]
[null,null,null,null,null,null,null,null,null,{"$f":"IF(ISERROR(INDEX(funList,MATCH(ROW()-ROW($J$1),Function!$C$110:$CX$110,0))),IF(ISERROR(INDEX(tabList,MATCH(ROW()-ROW($J$1),FactorTable!$B$111:$GS$111,0))),\"\",INDEX(tabList,MATCH(ROW()-ROW($J$1),FactorTable!$B$111:$GS$111,0))),INDEX(funList,MATCH(ROW()-ROW($J$1),Function!$C$110:$CX$110,0)))","v":""},{"$f":"IF(ISERROR(INDEX(funList,MATCH(ROW()-ROW($K$1),Function!$C$110:$CX$110,0))),\"\",INDEX(funList,MATCH(ROW()-ROW($K$1),Function!$C$110:$CX$110,0)))","v":""},{"$f":"IF(ISERROR(INDEX(indexList,MATCH(ROW()-ROW($L$1),Index!$B$383:$CW$383,0))),\"\",INDEX(indexList,MATCH(ROW()-ROW($L$1),Index!$B$383:$CW$383,0)))","v":""},{"$f":"IF(ISERROR(INDEX(funList,MATCH(ROW()-ROW($K$1),Function!$C$110:$CX$110,0))),\"\",INDEX(funList,MATCH(ROW()-ROW($K$1),Function!$C$110:$CX$110,0)))","v":""}]
[null,null,null,null,null,null,null,null,null,{"$f":"IF(ISERROR(INDEX(funList,MATCH(ROW()-ROW($J$1),Function!$C$110:$CX$110,0))),IF(ISERROR(INDEX(tabList,MATCH(ROW()-ROW($J$1),FactorTable!$B$111:$GS$111,0))),\"\",INDEX(tabList,MATCH(ROW()-ROW($J$1),FactorTable!$B$111:$GS$111,0))),INDEX(funList,MATCH(ROW()-ROW($J$1),Function!$C$110:$CX$110,0)))","v":""},{"$f":"IF(ISERROR(INDEX(funList,MATCH(ROW()-ROW($K$1),Function!$C$110:$CX$110,0))),\"\",INDEX(funList,MATCH(ROW()-ROW($K$1),Function!$C$110:$CX$110,0)))","v":""},{"$f":"IF(ISERROR(INDEX(indexList,MATCH(ROW()-ROW($L$1),Index!$B$383:$CW$383,0))),\"\",INDEX(indexList,MATCH(ROW()-ROW($L$1),Index!$B$383:$CW$383,0)))","v":""},{"$f":"IF(ISERROR(INDEX(funList,MATCH(ROW()-ROW($K$1),Function!$C$110:$CX$110,0))),\"\",INDEX(funList,MATCH(ROW()-ROW($K$1),Function!$C$110:$CX$110,0)))","v":""}]
[null,null,null,null,null,null,null,null,null,{"$f":"IF(ISERROR(INDEX(funList,MATCH(ROW()-ROW($J$1),Function!$C$110:$CX$110,0))),IF(ISERROR(INDEX(tabList,MATCH(ROW()-ROW($J$1),FactorTable!$B$111:$GS$111,0))),\"\",INDEX(tabList,MATCH(ROW()-ROW($J$1),FactorTable!$B$111:$GS$111,0))),INDEX(funList,MATCH(ROW()-ROW($J$1),Function!$C$110:$CX$110,0)))","v":""},{"$f":"IF(ISERROR(INDEX(funList,MATCH(ROW()-ROW($K$1),Function!$C$110:$CX$110,0))),\"\",INDEX(funList,MATCH(ROW()-ROW($K$1),Function!$C$110:$CX$110,0)))","v":""},{"$f":"IF(ISERROR(INDEX(indexList,MATCH(ROW()-ROW($L$1),Index!$B$383:$CW$383,0))),\"\",INDEX(indexList,MATCH(ROW()-ROW($L$1),Index!$B$383:$CW$383,0)))","v":""},{"$f":"IF(ISERROR(INDEX(funList,MATCH(ROW()-ROW($K$1),Function!$C$110:$CX$110,0))),\"\",INDEX(funList,MATCH(ROW()-ROW($K$1),Function!$C$110:$CX$110,0)))","v":""}]
[null,null,null,null,null,null,null,null,null,{"$f":"IF(ISERROR(INDEX(funList,MATCH(ROW()-ROW($J$1),Function!$C$110:$CX$110,0))),IF(ISERROR(INDEX(tabList,MATCH(ROW()-ROW($J$1),FactorTable!$B$111:$GS$111,0))),\"\",INDEX(tabList,MATCH(ROW()-ROW($J$1),FactorTable!$B$111:$GS$111,0))),INDEX(funList,MATCH(ROW()-ROW($J$1),Function!$C$110:$CX$110,0)))","v":""},{"$f":"IF(ISERROR(INDEX(funList,MATCH(ROW()-ROW($K$1),Function!$C$110:$CX$110,0))),\"\",INDEX(funList,MATCH(ROW()-ROW($K$1),Function!$C$110:$CX$110,0)))","v":""},{"$f":"IF(ISERROR(INDEX(indexList,MATCH(ROW()-ROW($L$1),Index!$B$383:$CW$383,0))),\"\",INDEX(indexList,MATCH(ROW()-ROW($L$1),Index!$B$383:$CW$383,0)))","v":""},{"$f":"IF(ISERROR(INDEX(funList,MATCH(ROW()-ROW($K$1),Function!$C$110:$CX$110,0))),\"\",INDEX(funList,MATCH(ROW()-ROW($K$1),Function!$C$110:$CX$110,0)))","v":""}]
[null,null,null,null,null,null,null,null,null,{"$f":"IF(ISERROR(INDEX(funList,MATCH(ROW()-ROW($J$1),Function!$C$110:$CX$110,0))),IF(ISERROR(INDEX(tabList,MATCH(ROW()-ROW($J$1),FactorTable!$B$111:$GS$111,0))),\"\",INDEX(tabList,MATCH(ROW()-ROW($J$1),FactorTable!$B$111:$GS$111,0))),INDEX(funList,MATCH(ROW()-ROW($J$1),Function!$C$110:$CX$110,0)))","v":""},{"$f":"IF(ISERROR(INDEX(funList,MATCH(ROW()-ROW($K$1),Function!$C$110:$CX$110,0))),\"\",INDEX(funList,MATCH(ROW()-ROW($K$1),Function!$C$110:$CX$110,0)))","v":""},{"$f":"IF(ISERROR(INDEX(indexList,MATCH(ROW()-ROW($L$1),Index!$B$383:$CW$383,0))),\"\",INDEX(indexList,MATCH(ROW()-ROW($L$1),Index!$B$383:$CW$383,0)))","v":""},{"$f":"IF(ISERROR(INDEX(funList,MATCH(ROW()-ROW($K$1),Function!$C$110:$CX$110,0))),\"\",INDEX(funList,MATCH(ROW()-ROW($K$1),Function!$C$110:$CX$110,0)))","v":""}]
[null,null,null,null,null,null,null,null,null,{"$f":"IF(ISERROR(INDEX(funList,MATCH(ROW()-ROW($J$1),Function!$C$110:$CX$110,0))),IF(ISERROR(INDEX(tabList,MATCH(ROW()-ROW($J$1),FactorTable!$B$111:$GS$111,0))),\"\",INDEX(tabList,MATCH(ROW()-ROW($J$1),FactorTable!$B$111:$GS$111,0))),INDEX(funList,MATCH(ROW()-ROW($J$1),Function!$C$110:$CX$110,0)))","v":""},{"$f":"IF(ISERROR(INDEX(funList,MATCH(ROW()-ROW($K$1),Function!$C$110:$CX$110,0))),\"\",INDEX(funList,MATCH(ROW()-ROW($K$1),Function!$C$110:$CX$110,0)))","v":""},{"$f":"IF(ISERROR(INDEX(indexList,MATCH(ROW()-ROW($L$1),Index!$B$383:$CW$383,0))),\"\",INDEX(indexList,MATCH(ROW()-ROW($L$1),Index!$B$383:$CW$383,0)))","v":""},{"$f":"IF(ISERROR(INDEX(funList,MATCH(ROW()-ROW($K$1),Function!$C$110:$CX$110,0))),\"\",INDEX(funList,MATCH(ROW()-ROW($K$1),Function!$C$110:$CX$110,0)))","v":""}]
[null,null,null,null,null,null,null,null,null,{"$f":"IF(ISERROR(INDEX(funList,MATCH(ROW()-ROW($J$1),Function!$C$110:$CX$110,0))),IF(ISERROR(INDEX(tabList,MATCH(ROW()-ROW($J$1),FactorTable!$B$111:$GS$111,0))),\"\",INDEX(tabList,MATCH(ROW()-ROW($J$1),FactorTable!$B$111:$GS$111,0))),INDEX(funList,MATCH(ROW()-ROW($J$1),Function!$C$110:$CX$110,0)))","v":""},{"$f":"IF(ISERROR(INDEX(funList,MATCH(ROW()-ROW($K$1),Function!$C$110:$CX$110,0))),\"\",INDEX(funList,MATCH(ROW()-ROW($K$1),Function!$C$110:$CX$110,0)))","v":""},{"$f":"IF(ISERROR(INDEX(indexList,MATCH(ROW()-ROW($L$1),Index!$B$383:$CW$383,0))),\"\",INDEX(indexList,MATCH(ROW()-ROW($L$1),Index!$B$383:$CW$383,0)))","v":""},{"$f":"IF(ISERROR(INDEX(funList,MATCH(ROW()-ROW($K$1),Function!$C$110:$CX$110,0))),\"\",INDEX(funList,MATCH(ROW()-ROW($K$1),Function!$C$110:$CX$110,0)))","v":""}]
[null,null,null,null,null,null,null,null,null,{"$f":"IF(ISERROR(INDEX(funList,MATCH(ROW()-ROW($J$1),Function!$C$110:$CX$110,0))),IF(ISERROR(INDEX(tabList,MATCH(ROW()-ROW($J$1),FactorTable!$B$111:$GS$111,0))),\"\",INDEX(tabList,MATCH(ROW()-ROW($J$1),FactorTable!$B$111:$GS$111,0))),INDEX(funList,MATCH(ROW()-ROW($J$1),Function!$C$110:$CX$110,0)))","v":""},{"$f":"IF(ISERROR(INDEX(funList,MATCH(ROW()-ROW($K$1),Function!$C$110:$CX$110,0))),\"\",INDEX(funList,MATCH(ROW()-ROW($K$1),Function!$C$110:$CX$110,0)))","v":""},{"$f":"IF(ISERROR(INDEX(indexList,MATCH(ROW()-ROW($L$1),Index!$B$383:$CW$383,0))),\"\",INDEX(indexList,MATCH(ROW()-ROW($L$1),Index!$B$383:$CW$383,0)))","v":""},{"$f":"IF(ISERROR(INDEX(funList,MATCH(ROW()-ROW($K$1),Function!$C$110:$CX$110,0))),\"\",INDEX(funList,MATCH(ROW()-ROW($K$1),Function!$C$110:$CX$110,0)))","v":""}]
[null,null,null,null,null,null,null,null,null,{"$f":"IF(ISERROR(INDEX(funList,MATCH(ROW()-ROW($J$1),Function!$C$110:$CX$110,0))),IF(ISERROR(INDEX(tabList,MATCH(ROW()-ROW($J$1),FactorTable!$B$111:$GS$111,0))),\"\",INDEX(tabList,MATCH(ROW()-ROW($J$1),FactorTable!$B$111:$GS$111,0))),INDEX(funList,MATCH(ROW()-ROW($J$1),Function!$C$110:$CX$110,0)))","v":""},{"$f":"IF(ISERROR(INDEX(funList,MATCH(ROW()-ROW($K$1),Function!$C$110:$CX$110,0))),\"\",INDEX(funList,MATCH(ROW()-ROW($K$1),Function!$C$110:$CX$110,0)))","v":""},{"$f":"IF(ISERROR(INDEX(indexList,MATCH(ROW()-ROW($L$1),Index!$B$383:$CW$383,0))),\"\",INDEX(indexList,MATCH(ROW()-ROW($L$1),Index!$B$383:$CW$383,0)))","v":""},{"$f":"IF(ISERROR(INDEX(funList,MATCH(ROW()-ROW($K$1),Function!$C$110:$CX$110,0))),\"\",INDEX(funList,MATCH(ROW()-ROW($K$1),Function!$C$110:$CX$110,0)))","v":""}]
[null,null,null,null,null,null,null,null,null,{"$f":"IF(ISERROR(INDEX(funList,MATCH(ROW()-ROW($J$1),Function!$C$110:$CX$110,0))),IF(ISERROR(INDEX(tabList,MATCH(ROW()-ROW($J$1),FactorTable!$B$111:$GS$111,0))),\"\",INDEX(tabList,MATCH(ROW()-ROW($J$1),FactorTable!$B$111:$GS$111,0))),INDEX(funList,MATCH(ROW()-ROW($J$1),Function!$C$110:$CX$110,0)))","v":""},{"$f":"IF(ISERROR(INDEX(funList,MATCH(ROW()-ROW($K$1),Function!$C$110:$CX$110,0))),\"\",INDEX(funList,MATCH(ROW()-ROW($K$1),Function!$C$110:$CX$110,0)))","v":""},{"$f":"IF(ISERROR(INDEX(indexList,MATCH(ROW()-ROW($L$1),Index!$B$383:$CW$383,0))),\"\",INDEX(indexList,MATCH(ROW()-ROW($L$1),Index!$B$383:$CW$383,0)))","v":""},{"$f":"IF(ISERROR(INDEX(funList,MATCH(ROW()-ROW($K$1),Function!$C$110:$CX$110,0))),\"\",INDEX(funList,MATCH(ROW()-ROW($K$1),Function!$C$110:$CX$110,0)))","v":""}]
[null,null,null,null,null,null,null,null,null,{"$f":"IF(ISERROR(INDEX(funList,MATCH(ROW()-ROW($J$1),Function!$C$110:$CX$110,0))),IF(ISERROR(INDEX(tabList,MATCH(ROW()-ROW($J$1),FactorTable!$B$111:$GS$111,0))),\"\",INDEX(tabList,MATCH(ROW()-ROW($J$1),FactorTable!$B$111:$GS$111,0))),INDEX(funList,MATCH(ROW()-ROW($J$1),Function!$C$110:$CX$110,0)))","v":""},{"$f":"IF(ISERROR(INDEX(funList,MATCH(ROW()-ROW($K$1),Function!$C$110:$CX$110,0))),\"\",INDEX(funList,MATCH(ROW()-ROW($K$1),Function!$C$110:$CX$110,0)))","v":""},{"$f":"IF(ISERROR(INDEX(indexList,MATCH(ROW()-ROW($L$1),Index!$B$383:$CW$383,0))),\"\",INDEX(indexList,MATCH(ROW()-ROW($L$1),Index!$B$383:$CW$383,0)))","v":""},{"$f":"IF(ISERROR(INDEX(funList,MATCH(ROW()-ROW($K$1),Function!$C$110:$CX$110,0))),\"\",INDEX(funList,MATCH(ROW()-ROW($K$1),Function!$C$110:$CX$110,0)))","v":""}]
[null,null,null,null,null,null,null,null,null,{"$f":"IF(ISERROR(INDEX(funList,MATCH(ROW()-ROW($J$1),Function!$C$110:$CX$110,0))),IF(ISERROR(INDEX(tabList,MATCH(ROW()-ROW($J$1),FactorTable!$B$111:$GS$111,0))),\"\",INDEX(tabList,MATCH(ROW()-ROW($J$1),FactorTable!$B$111:$GS$111,0))),INDEX(funList,MATCH(ROW()-ROW($J$1),Function!$C$110:$CX$110,0)))","v":""},{"$f":"IF(ISERROR(INDEX(funList,MATCH(ROW()-ROW($K$1),Function!$C$110:$CX$110,0))),\"\",INDEX(funList,MATCH(ROW()-ROW($K$1),Function!$C$110:$CX$110,0)))","v":""},{"$f":"IF(ISERROR(INDEX(indexList,MATCH(ROW()-ROW($L$1),Index!$B$383:$CW$383,0))),\"\",INDEX(indexList,MATCH(ROW()-ROW($L$1),Index!$B$383:$CW$383,0)))","v":""},{"$f":"IF(ISERROR(INDEX(funList,MATCH(ROW()-ROW($K$1),Function!$C$110:$CX$110,0))),\"\",INDEX(funList,MATCH(ROW()-ROW($K$1),Function!$C$110:$CX$110,0)))","v":""}]
[null,null,null,null,null,null,null,null,null,{"$f":"IF(ISERROR(INDEX(funList,MATCH(ROW()-ROW($J$1),Function!$C$110:$CX$110,0))),IF(ISERROR(INDEX(tabList,MATCH(ROW()-ROW($J$1),FactorTable!$B$111:$GS$111,0))),\"\",INDEX(tabList,MATCH(ROW()-ROW($J$1),FactorTable!$B$111:$GS$111,0))),INDEX(funList,MATCH(ROW()-ROW($J$1),Function!$C$110:$CX$110,0)))","v":""},{"$f":"IF(ISERROR(INDEX(funList,MATCH(ROW()-ROW($K$1),Function!$C$110:$CX$110,0))),\"\",INDEX(funList,MATCH(ROW()-ROW($K$1),Function!$C$110:$CX$110,0)))","v":""},{"$f":"IF(ISERROR(INDEX(indexList,MATCH(ROW()-ROW($L$1),Index!$B$383:$CW$383,0))),\"\",INDEX(indexList,MATCH(ROW()-ROW($L$1),Index!$B$383:$CW$383,0)))","v":""},{"$f":"IF(ISERROR(INDEX(funList,MATCH(ROW()-ROW($K$1),Function!$C$110:$CX$110,0))),\"\",INDEX(funList,MATCH(ROW()-ROW($K$1),Function!$C$110:$CX$110,0)))","v":""}]
[null,null,null,null,null,null,null,null,null,{"$f":"IF(ISERROR(INDEX(funList,MATCH(ROW()-ROW($J$1),Function!$C$110:$CX$110,0))),IF(ISERROR(INDEX(tabList,MATCH(ROW()-ROW($J$1),FactorTable!$B$111:$GS$111,0))),\"\",INDEX(tabList,MATCH(ROW()-ROW($J$1),FactorTable!$B$111:$GS$111,0))),INDEX(funList,MATCH(ROW()-ROW($J$1),Function!$C$110:$CX$110,0)))","v":""},{"$f":"IF(ISERROR(INDEX(funList,MATCH(ROW()-ROW($K$1),Function!$C$110:$CX$110,0))),\"\",INDEX(funList,MATCH(ROW()-ROW($K$1),Function!$C$110:$CX$110,0)))","v":""},{"$f":"IF(ISERROR(INDEX(indexList,MATCH(ROW()-ROW($L$1),Index!$B$383:$CW$383,0))),\"\",INDEX(indexList,MATCH(ROW()-ROW($L$1),Index!$B$383:$CW$383,0)))","v":""},{"$f":"IF(ISERROR(INDEX(funList,MATCH(ROW()-ROW($K$1),Function!$C$110:$CX$110,0))),\"\",INDEX(funList,MATCH(ROW()-ROW($K$1),Function!$C$110:$CX$110,0)))","v":""}]
[null,null,null,null,null,null,null,null,null,{"$f":"IF(ISERROR(INDEX(funList,MATCH(ROW()-ROW($J$1),Function!$C$110:$CX$110,0))),IF(ISERROR(INDEX(tabList,MATCH(ROW()-ROW($J$1),FactorTable!$B$111:$GS$111,0))),\"\",INDEX(tabList,MATCH(ROW()-ROW($J$1),FactorTable!$B$111:$GS$111,0))),INDEX(funList,MATCH(ROW()-ROW($J$1),Function!$C$110:$CX$110,0)))","v":""},{"$f":"IF(ISERROR(INDEX(funList,MATCH(ROW()-ROW($K$1),Function!$C$110:$CX$110,0))),\"\",INDEX(funList,MATCH(ROW()-ROW($K$1),Function!$C$110:$CX$110,0)))","v":""},{"$f":"IF(ISERROR(INDEX(indexList,MATCH(ROW()-ROW($L$1),Index!$B$383:$CW$383,0))),\"\",INDEX(indexList,MATCH(ROW()-ROW($L$1),Index!$B$383:$CW$383,0)))","v":""},{"$f":"IF(ISERROR(INDEX(funList,MATCH(ROW()-ROW($K$1),Function!$C$110:$CX$110,0))),\"\",INDEX(funList,MATCH(ROW()-ROW($K$1),Function!$C$110:$CX$110,0)))","v":""}]
[null,null,null,null,null,null,null,null,null,{"$f":"IF(ISERROR(INDEX(funList,MATCH(ROW()-ROW($J$1),Function!$C$110:$CX$110,0))),IF(ISERROR(INDEX(tabList,MATCH(ROW()-ROW($J$1),FactorTable!$B$111:$GS$111,0))),\"\",INDEX(tabList,MATCH(ROW()-ROW($J$1),FactorTable!$B$111:$GS$111,0))),INDEX(funList,MATCH(ROW()-ROW($J$1),Function!$C$110:$CX$110,0)))","v":""},{"$f":"IF(ISERROR(INDEX(funList,MATCH(ROW()-ROW($K$1),Function!$C$110:$CX$110,0))),\"\",INDEX(funList,MATCH(ROW()-ROW($K$1),Function!$C$110:$CX$110,0)))","v":""},{"$f":"IF(ISERROR(INDEX(indexList,MATCH(ROW()-ROW($L$1),Index!$B$383:$CW$383,0))),\"\",INDEX(indexList,MATCH(ROW()-ROW($L$1),Index!$B$383:$CW$383,0)))","v":""},{"$f":"IF(ISERROR(INDEX(funList,MATCH(ROW()-ROW($K$1),Function!$C$110:$CX$110,0))),\"\",INDEX(funList,MATCH(ROW()-ROW($K$1),Function!$C$110:$CX$110,0)))","v":""}]
[null,null,null,null,null,null,null,null,null,{"$f":"IF(ISERROR(INDEX(funList,MATCH(ROW()-ROW($J$1),Function!$C$110:$CX$110,0))),IF(ISERROR(INDEX(tabList,MATCH(ROW()-ROW($J$1),FactorTable!$B$111:$GS$111,0))),\"\",INDEX(tabList,MATCH(ROW()-ROW($J$1),FactorTable!$B$111:$GS$111,0))),INDEX(funList,MATCH(ROW()-ROW($J$1),Function!$C$110:$CX$110,0)))","v":""},{"$f":"IF(ISERROR(INDEX(funList,MATCH(ROW()-ROW($K$1),Function!$C$110:$CX$110,0))),\"\",INDEX(funList,MATCH(ROW()-ROW($K$1),Function!$C$110:$CX$110,0)))","v":""},{"$f":"IF(ISERROR(INDEX(indexList,MATCH(ROW()-ROW($L$1),Index!$B$383:$CW$383,0))),\"\",INDEX(indexList,MATCH(ROW()-ROW($L$1),Index!$B$383:$CW$383,0)))","v":""},{"$f":"IF(ISERROR(INDEX(funList,MATCH(ROW()-ROW($K$1),Function!$C$110:$CX$110,0))),\"\",INDEX(funList,MATCH(ROW()-ROW($K$1),Function!$C$110:$CX$110,0)))","v":""}]
[null,null,null,null,null,null,null,null,null,{"$f":"IF(ISERROR(INDEX(funList,MATCH(ROW()-ROW($J$1),Function!$C$110:$CX$110,0))),IF(ISERROR(INDEX(tabList,MATCH(ROW()-ROW($J$1),FactorTable!$B$111:$GS$111,0))),\"\",INDEX(tabList,MATCH(ROW()-ROW($J$1),FactorTable!$B$111:$GS$111,0))),INDEX(funList,MATCH(ROW()-ROW($J$1),Function!$C$110:$CX$110,0)))","v":""},{"$f":"IF(ISERROR(INDEX(funList,MATCH(ROW()-ROW($K$1),Function!$C$110:$CX$110,0))),\"\",INDEX(funList,MATCH(ROW()-ROW($K$1),Function!$C$110:$CX$110,0)))","v":""},{"$f":"IF(ISERROR(INDEX(indexList,MATCH(ROW()-ROW($L$1),Index!$B$383:$CW$383,0))),\"\",INDEX(indexList,MATCH(ROW()-ROW($L$1),Index!$B$383:$CW$383,0)))","v":""},{"$f":"IF(ISERROR(INDEX(funList,MATCH(ROW()-ROW($K$1),Function!$C$110:$CX$110,0))),\"\",INDEX(funList,MATCH(ROW()-ROW($K$1),Function!$C$110:$CX$110,0)))","v":""}]
[null,null,null,null,null,null,null,null,null,{"$f":"IF(ISERROR(INDEX(funList,MATCH(ROW()-ROW($J$1),Function!$C$110:$CX$110,0))),IF(ISERROR(INDEX(tabList,MATCH(ROW()-ROW($J$1),FactorTable!$B$111:$GS$111,0))),\"\",INDEX(tabList,MATCH(ROW()-ROW($J$1),FactorTable!$B$111:$GS$111,0))),INDEX(funList,MATCH(ROW()-ROW($J$1),Function!$C$110:$CX$110,0)))","v":""},{"$f":"IF(ISERROR(INDEX(funList,MATCH(ROW()-ROW($K$1),Function!$C$110:$CX$110,0))),\"\",INDEX(funList,MATCH(ROW()-ROW($K$1),Function!$C$110:$CX$110,0)))","v":""},{"$f":"IF(ISERROR(INDEX(indexList,MATCH(ROW()-ROW($L$1),Index!$B$383:$CW$383,0))),\"\",INDEX(indexList,MATCH(ROW()-ROW($L$1),Index!$B$383:$CW$383,0)))","v":""},{"$f":"IF(ISERROR(INDEX(funList,MATCH(ROW()-ROW($K$1),Function!$C$110:$CX$110,0))),\"\",INDEX(funList,MATCH(ROW()-ROW($K$1),Function!$C$110:$CX$110,0)))","v":""}]
[null,null,null,null,null,null,null,null,null,{"$f":"IF(ISERROR(INDEX(funList,MATCH(ROW()-ROW($J$1),Function!$C$110:$CX$110,0))),IF(ISERROR(INDEX(tabList,MATCH(ROW()-ROW($J$1),FactorTable!$B$111:$GS$111,0))),\"\",INDEX(tabList,MATCH(ROW()-ROW($J$1),FactorTable!$B$111:$GS$111,0))),INDEX(funList,MATCH(ROW()-ROW($J$1),Function!$C$110:$CX$110,0)))","v":""},{"$f":"IF(ISERROR(INDEX(funList,MATCH(ROW()-ROW($K$1),Function!$C$110:$CX$110,0))),\"\",INDEX(funList,MATCH(ROW()-ROW($K$1),Function!$C$110:$CX$110,0)))","v":""},{"$f":"IF(ISERROR(INDEX(indexList,MATCH(ROW()-ROW($L$1),Index!$B$383:$CW$383,0))),\"\",INDEX(indexList,MATCH(ROW()-ROW($L$1),Index!$B$383:$CW$383,0)))","v":""},{"$f":"IF(ISERROR(INDEX(funList,MATCH(ROW()-ROW($K$1),Function!$C$110:$CX$110,0))),\"\",INDEX(funList,MATCH(ROW()-ROW($K$1),Function!$C$110:$CX$110,0)))","v":""}]
[null,null,null,null,null,null,null,null,null,{"$f":"IF(ISERROR(INDEX(funList,MATCH(ROW()-ROW($J$1),Function!$C$110:$CX$110,0))),IF(ISERROR(INDEX(tabList,MATCH(ROW()-ROW($J$1),FactorTable!$B$111:$GS$111,0))),\"\",INDEX(tabList,MATCH(ROW()-ROW($J$1),FactorTable!$B$111:$GS$111,0))),INDEX(funList,MATCH(ROW()-ROW($J$1),Function!$C$110:$CX$110,0)))","v":""},{"$f":"IF(ISERROR(INDEX(funList,MATCH(ROW()-ROW($K$1),Function!$C$110:$CX$110,0))),\"\",INDEX(funList,MATCH(ROW()-ROW($K$1),Function!$C$110:$CX$110,0)))","v":""},{"$f":"IF(ISERROR(INDEX(indexList,MATCH(ROW()-ROW($L$1),Index!$B$383:$CW$383,0))),\"\",INDEX(indexList,MATCH(ROW()-ROW($L$1),Index!$B$383:$CW$383,0)))","v":""},{"$f":"IF(ISERROR(INDEX(funList,MATCH(ROW()-ROW($K$1),Function!$C$110:$CX$110,0))),\"\",INDEX(funList,MATCH(ROW()-ROW($K$1),Function!$C$110:$CX$110,0)))","v":""}]
[null,null,null,null,null,null,null,null,null,{"$f":"IF(ISERROR(INDEX(funList,MATCH(ROW()-ROW($J$1),Function!$C$110:$CX$110,0))),IF(ISERROR(INDEX(tabList,MATCH(ROW()-ROW($J$1),FactorTable!$B$111:$GS$111,0))),\"\",INDEX(tabList,MATCH(ROW()-ROW($J$1),FactorTable!$B$111:$GS$111,0))),INDEX(funList,MATCH(ROW()-ROW($J$1),Function!$C$110:$CX$110,0)))","v":""},{"$f":"IF(ISERROR(INDEX(funList,MATCH(ROW()-ROW($K$1),Function!$C$110:$CX$110,0))),\"\",INDEX(funList,MATCH(ROW()-ROW($K$1),Function!$C$110:$CX$110,0)))","v":""},{"$f":"IF(ISERROR(INDEX(indexList,MATCH(ROW()-ROW($L$1),Index!$B$383:$CW$383,0))),\"\",INDEX(indexList,MATCH(ROW()-ROW($L$1),Index!$B$383:$CW$383,0)))","v":""},{"$f":"IF(ISERROR(INDEX(funList,MATCH(ROW()-ROW($K$1),Function!$C$110:$CX$110,0))),\"\",INDEX(funList,MATCH(ROW()-ROW($K$1),Function!$C$110:$CX$110,0)))","v":""}]
[null,null,null,null,null,null,null,null,null,{"$f":"IF(ISERROR(INDEX(funList,MATCH(ROW()-ROW($J$1),Function!$C$110:$CX$110,0))),IF(ISERROR(INDEX(tabList,MATCH(ROW()-ROW($J$1),FactorTable!$B$111:$GS$111,0))),\"\",INDEX(tabList,MATCH(ROW()-ROW($J$1),FactorTable!$B$111:$GS$111,0))),INDEX(funList,MATCH(ROW()-ROW($J$1),Function!$C$110:$CX$110,0)))","v":""},{"$f":"IF(ISERROR(INDEX(funList,MATCH(ROW()-ROW($K$1),Function!$C$110:$CX$110,0))),\"\",INDEX(funList,MATCH(ROW()-ROW($K$1),Function!$C$110:$CX$110,0)))","v":""},{"$f":"IF(ISERROR(INDEX(indexList,MATCH(ROW()-ROW($L$1),Index!$B$383:$CW$383,0))),\"\",INDEX(indexList,MATCH(ROW()-ROW($L$1),Index!$B$383:$CW$383,0)))","v":""},{"$f":"IF(ISERROR(INDEX(funList,MATCH(ROW()-ROW($K$1),Function!$C$110:$CX$110,0))),\"\",INDEX(funList,MATCH(ROW()-ROW($K$1),Function!$C$110:$CX$110,0)))","v":""}]
[null,null,null,null,null,null,null,null,null,{"$f":"IF(ISERROR(INDEX(funList,MATCH(ROW()-ROW($J$1),Function!$C$110:$CX$110,0))),IF(ISERROR(INDEX(tabList,MATCH(ROW()-ROW($J$1),FactorTable!$B$111:$GS$111,0))),\"\",INDEX(tabList,MATCH(ROW()-ROW($J$1),FactorTable!$B$111:$GS$111,0))),INDEX(funList,MATCH(ROW()-ROW($J$1),Function!$C$110:$CX$110,0)))","v":""},{"$f":"IF(ISERROR(INDEX(funList,MATCH(ROW()-ROW($K$1),Function!$C$110:$CX$110,0))),\"\",INDEX(funList,MATCH(ROW()-ROW($K$1),Function!$C$110:$CX$110,0)))","v":""},{"$f":"IF(ISERROR(INDEX(indexList,MATCH(ROW()-ROW($L$1),Index!$B$383:$CW$383,0))),\"\",INDEX(indexList,MATCH(ROW()-ROW($L$1),Index!$B$383:$CW$383,0)))","v":""},{"$f":"IF(ISERROR(INDEX(funList,MATCH(ROW()-ROW($K$1),Function!$C$110:$CX$110,0))),\"\",INDEX(funList,MATCH(ROW()-ROW($K$1),Function!$C$110:$CX$110,0)))","v":""}]
[null,null,null,null,null,null,null,null,null,{"$f":"IF(ISERROR(INDEX(funList,MATCH(ROW()-ROW($J$1),Function!$C$110:$CX$110,0))),IF(ISERROR(INDEX(tabList,MATCH(ROW()-ROW($J$1),FactorTable!$B$111:$GS$111,0))),\"\",INDEX(tabList,MATCH(ROW()-ROW($J$1),FactorTable!$B$111:$GS$111,0))),INDEX(funList,MATCH(ROW()-ROW($J$1),Function!$C$110:$CX$110,0)))","v":""},{"$f":"IF(ISERROR(INDEX(funList,MATCH(ROW()-ROW($K$1),Function!$C$110:$CX$110,0))),\"\",INDEX(funList,MATCH(ROW()-ROW($K$1),Function!$C$110:$CX$110,0)))","v":""},{"$f":"IF(ISERROR(INDEX(indexList,MATCH(ROW()-ROW($L$1),Index!$B$383:$CW$383,0))),\"\",INDEX(indexList,MATCH(ROW()-ROW($L$1),Index!$B$383:$CW$383,0)))","v":""},{"$f":"IF(ISERROR(INDEX(funList,MATCH(ROW()-ROW($K$1),Function!$C$110:$CX$110,0))),\"\",INDEX(funList,MATCH(ROW()-ROW($K$1),Function!$C$110:$CX$110,0)))","v":""}]
[null,null,null,null,null,null,null,null,null,{"$f":"IF(ISERROR(INDEX(funList,MATCH(ROW()-ROW($J$1),Function!$C$110:$CX$110,0))),IF(ISERROR(INDEX(tabList,MATCH(ROW()-ROW($J$1),FactorTable!$B$111:$GS$111,0))),\"\",INDEX(tabList,MATCH(ROW()-ROW($J$1),FactorTable!$B$111:$GS$111,0))),INDEX(funList,MATCH(ROW()-ROW($J$1),Function!$C$110:$CX$110,0)))","v":""},{"$f":"IF(ISERROR(INDEX(funList,MATCH(ROW()-ROW($K$1),Function!$C$110:$CX$110,0))),\"\",INDEX(funList,MATCH(ROW()-ROW($K$1),Function!$C$110:$CX$110,0)))","v":""},{"$f":"IF(ISERROR(INDEX(indexList,MATCH(ROW()-ROW($L$1),Index!$B$383:$CW$383,0))),\"\",INDEX(indexList,MATCH(ROW()-ROW($L$1),Index!$B$383:$CW$383,0)))","v":""},{"$f":"IF(ISERROR(INDEX(funList,MATCH(ROW()-ROW($K$1),Function!$C$110:$CX$110,0))),\"\",INDEX(funList,MATCH(ROW()-ROW($K$1),Function!$C$110:$CX$110,0)))","v":""}]